Merge branch 'node-issue' into 'master'

nodejs 9 is not supported anymore

See merge request !1361
42 jobs for master in 32 minutes and 20 seconds (queued for 22 seconds)
Status Name Job ID Coverage
  Test
passed test:backend:annotation:jdk-11 #305923

00:10:21

88.3975%
passed test:backend:annotation:jdk-11-hsql #305926

00:09:55

88.3975%
passed test:backend:annotation:jdk-8 #305921

00:09:23

88.397%
passed test:backend:CellDesigner_plugin:jdk-8 #305929

00:01:22

85.1653%
passed test:backend:commons:jdk-11 #305917

00:01:55

73.9551%
passed test:backend:commons:jdk-8 #305914

00:01:11

73.9551%
passed test:backend:converter_CellDesigner:jdk-11 #305942

00:03:29

95.6709%
passed test:backend:converter_CellDesigner:jdk-8 #305938

00:01:43

95.6703%
passed test:backend:converter_graphics:jdk-11 #305946

00:01:53

74.5855%
passed test:backend:converter_graphics:jdk-8 #305945

00:01:51

74.5915%
passed test:backend:converter:jdk-11 #305935

00:00:54

65.4668%
passed test:backend:converter:jdk-8 #305932

00:01:32

65.4668%
passed test:backend:converter_SBGNML:jdk-11 #305952

00:03:13

89.107%
passed test:backend:converter_SBGNML:jdk-11-hsql #305955

00:08:08

89.107%
passed test:backend:converter_SBGNML:jdk-8 #305949

00:02:44

89.1058%
passed test:backend:converter_SBML:jdk-11 #305961

00:03:01

90.847%
passed test:backend:converter_SBML:jdk-8 #305958

00:05:28

90.846%
passed test:backend:model_command:jdk-11 #305975

00:01:41

76.8248%
passed test:backend:model_command:jdk-8 #305971

00:02:09

76.8351%
passed test:backend:model:jdk-11 #305968

00:01:04

80.9056%
passed test:backend:model:jdk-8 #305965

00:01:40

80.9071%
passed test:backend:pathvisio:jdk-11 #305981

00:01:15

85.2726%
passed test:backend:pathvisio:jdk-8 #305978

00:01:36

85.2746%
passed test:backend:persist:hsql #305991

00:01:20

71.2653%
passed test:backend:persist:jdk-11 #305988

00:01:34

71.2653%
passed test:backend:persist:jdk-8 #305984

00:03:22

71.1221%
passed test:backend:rest:hsql #306001

00:01:18

3.32092%
passed test:backend:rest:jdk-11 #305998

00:04:46

3.32092%
passed test:backend:rest:jdk-8 #305996

00:01:55

3.32221%
passed test:backend:service:hsql #306009

00:07:24

54.4648%
passed test:backend:service:jdk-11 #306007

00:06:09

54.4648%
passed test:backend:service:jdk-8 #306005

00:07:20

54.4698%
failed test:backend:web:hsql #306014

00:20:09

failed test:backend:web:jdk-11 #306012

00:15:12

failed test:backend:web:jdk-8 #306010

00:14:24

passed test:code_validation #306018

00:04:10

passed test:dependency_conflict #306016

00:04:29

passed test:frontend #305910

00:02:14

84.63%
passed test:mvn_changelog_version_check #306020

00:01:04

passed test_postgres_10_compatibility #306024

00:02:14

passed test_postgres_11_compatibility #306025

00:01:41

passed test_postgres_9_3_compatibility #306022

00:04:45

 
Name Stage Failure
failed
test:backend:web:jdk-8 Test
[ERROR] -> [Help 1]
[ERROR]
[ERROR] To see the full stack trace of the errors, re-run Maven with the -e switch.
[ERROR] Re-run Maven using the -X switch to enable full debug logging.
[ERROR]
[ERROR] For more information about the errors and possible solutions, please read the following articles:
[ERROR] [Help 1] http://cwiki.apache.org/confluence/display/MAVEN/MojoFailureException
Cleaning up project directory and file based variables
ERROR: Job failed: exit code 1

failed
test:backend:web:hsql Test
[ERROR] -> [Help 1]
[ERROR]
[ERROR] To see the full stack trace of the errors, re-run Maven with the -e switch.
[ERROR] Re-run Maven using the -X switch to enable full debug logging.
[ERROR]
[ERROR] For more information about the errors and possible solutions, please read the following articles:
[ERROR] [Help 1] http://cwiki.apache.org/confluence/display/MAVEN/MojoFailureException
Cleaning up project directory and file based variables
ERROR: Job failed: exit code 1

failed
test:backend:web:jdk-11 Test
[ERROR] -> [Help 1]
[ERROR]
[ERROR] To see the full stack trace of the errors, re-run Maven with the -e switch.
[ERROR] Re-run Maven using the -X switch to enable full debug logging.
[ERROR]
[ERROR] For more information about the errors and possible solutions, please read the following articles:
[ERROR] [Help 1] http://cwiki.apache.org/confluence/display/MAVEN/MojoFailureException
Cleaning up project directory and file based variables
ERROR: Job failed: exit code 1