Merge branch 'node-issue' into 'master'

nodejs 9 is not supported anymore

See merge request !1361
42 jobs for master in 34 minutes and 41 seconds (queued for 12 seconds)
Status Name Job ID Coverage
  Test
passed test:backend:annotation:jdk-11 #305706

00:07:05

88.3975%
passed test:backend:annotation:jdk-11-hsql #305710

00:07:47

88.3975%
passed test:backend:annotation:jdk-8 #305703

00:12:34

88.397%
passed test:backend:CellDesigner_plugin:jdk-8 #305712

00:01:25

85.1653%
passed test:backend:commons:jdk-11 #305699

00:01:50

73.9551%
passed test:backend:commons:jdk-8 #305694

00:02:00

73.9551%
passed test:backend:converter_CellDesigner:jdk-11 #305725

00:01:29

95.6408%
passed test:backend:converter_CellDesigner:jdk-8 #305722

00:01:25

95.6703%
passed test:backend:converter_graphics:jdk-11 #305731

00:01:05

74.5855%
passed test:backend:converter_graphics:jdk-8 #305728

00:02:56

74.5915%
passed test:backend:converter:jdk-11 #305719

00:01:27

65.2981%
passed test:backend:converter:jdk-8 #305716

00:01:12

65.4387%
passed test:backend:converter_SBGNML:jdk-11 #305737

00:09:08

89.107%
passed test:backend:converter_SBGNML:jdk-11-hsql #305741

00:04:29

89.107%
passed test:backend:converter_SBGNML:jdk-8 #305734

00:01:56

89.1058%
passed test:backend:converter_SBML:jdk-11 #305748

00:05:27

90.847%
passed test:backend:converter_SBML:jdk-8 #305745

00:02:59

90.846%
passed test:backend:model_command:jdk-11 #305760

00:03:08

76.8248%
passed test:backend:model_command:jdk-8 #305757

00:01:36

76.8351%
passed test:backend:model:jdk-11 #305754

00:03:44

80.9056%
passed test:backend:model:jdk-8 #305751

00:01:21

80.9071%
passed test:backend:pathvisio:jdk-11 #305766

00:01:59

85.2726%
passed test:backend:pathvisio:jdk-8 #305763

00:01:09

85.2746%
passed test:backend:persist:hsql #305776

00:03:14

71.2653%
passed test:backend:persist:jdk-11 #305772

00:03:40

71.2653%
passed test:backend:persist:jdk-8 #305769

00:02:57

71.1221%
passed test:backend:rest:hsql #305786

00:01:56

3.32092%
passed test:backend:rest:jdk-11 #305781

00:03:50

3.32092%
passed test:backend:rest:jdk-8 #305778

00:03:29

3.32221%
passed test:backend:service:hsql #305794

00:10:39

54.4648%
passed test:backend:service:jdk-11 #305792

00:10:19

54.4648%
passed test:backend:service:jdk-8 #305788

00:07:59

54.4698%
failed test:backend:web:hsql #305800

00:20:56

failed test:backend:web:jdk-11 #305798

00:21:59

failed test:backend:web:jdk-8 #305796

00:20:05

passed test:code_validation #305804

00:02:42

passed test:dependency_conflict #305803

00:06:39

passed test:frontend #305691

00:03:51

84.63%
passed test:mvn_changelog_version_check #305805

00:00:34

passed test_postgres_10_compatibility #305807

00:01:47

passed test_postgres_11_compatibility #305808

00:02:15

passed test_postgres_9_3_compatibility #305806

00:02:57

 
Name Stage Failure
failed
test:backend:web:jdk-11 Test
[ERROR] -> [Help 1]
[ERROR]
[ERROR] To see the full stack trace of the errors, re-run Maven with the -e switch.
[ERROR] Re-run Maven using the -X switch to enable full debug logging.
[ERROR]
[ERROR] For more information about the errors and possible solutions, please read the following articles:
[ERROR] [Help 1] http://cwiki.apache.org/confluence/display/MAVEN/MojoFailureException
Cleaning up project directory and file based variables
ERROR: Job failed: exit code 1

failed
test:backend:web:jdk-8 Test
[ERROR] -> [Help 1]
[ERROR]
[ERROR] To see the full stack trace of the errors, re-run Maven with the -e switch.
[ERROR] Re-run Maven using the -X switch to enable full debug logging.
[ERROR]
[ERROR] For more information about the errors and possible solutions, please read the following articles:
[ERROR] [Help 1] http://cwiki.apache.org/confluence/display/MAVEN/MojoFailureException
Cleaning up project directory and file based variables
ERROR: Job failed: exit code 1

failed
test:backend:web:hsql Test
[ERROR] -> [Help 1]
[ERROR]
[ERROR] To see the full stack trace of the errors, re-run Maven with the -e switch.
[ERROR] Re-run Maven using the -X switch to enable full debug logging.
[ERROR]
[ERROR] For more information about the errors and possible solutions, please read the following articles:
[ERROR] [Help 1] http://cwiki.apache.org/confluence/display/MAVEN/MojoFailureException
Cleaning up project directory and file based variables
ERROR: Job failed: exit code 1