Merge remote-tracking branch 'origin/master' into node-issue

42 jobs for node-issue in 60 minutes and 1 second (queued for 8 seconds)
Status Name Job ID Coverage
  Test
failed test:backend:annotation:jdk-11 #301565

00:10:28

failed test:backend:annotation:jdk-11-hsql #301566

01:00:00

failed test:backend:annotation:jdk-8 #301564

00:13:18

passed test:backend:CellDesigner_plugin:jdk-8 #301567

00:02:23

85.1653%
passed test:backend:commons:jdk-11 #301563

00:04:02

73.9551%
passed test:backend:commons:jdk-8 #301562

00:01:46

73.9551%
passed test:backend:converter_CellDesigner:jdk-11 #301571

00:02:34

95.6709%
passed test:backend:converter_CellDesigner:jdk-8 #301570

00:02:35

95.6703%
passed test:backend:converter_graphics:jdk-11 #301573

00:02:16

74.5855%
passed test:backend:converter_graphics:jdk-8 #301572

00:04:50

74.5915%
passed test:backend:converter:jdk-11 #301569

00:01:30

65.4246%
passed test:backend:converter:jdk-8 #301568

00:04:13

65.4668%
passed test:backend:converter_SBGNML:jdk-11 #301575

00:09:26

89.107%
passed test:backend:converter_SBGNML:jdk-11-hsql #301576

00:07:32

89.107%
passed test:backend:converter_SBGNML:jdk-8 #301574

00:03:36

89.1058%
passed test:backend:converter_SBML:jdk-11 #301578

00:05:48

90.847%
passed test:backend:converter_SBML:jdk-8 #301577

00:06:32

90.846%
passed test:backend:model_command:jdk-11 #301582

00:04:11

76.8125%
passed test:backend:model_command:jdk-8 #301581

00:02:03

76.8351%
passed test:backend:model:jdk-11 #301580

00:02:04

80.9056%
passed test:backend:model:jdk-8 #301579

00:04:52

80.9071%
passed test:backend:pathvisio:jdk-11 #301584

00:04:29

85.2726%
passed test:backend:pathvisio:jdk-8 #301583

00:04:24

85.2746%
passed test:backend:persist:hsql #301587

00:01:56

71.2653%
passed test:backend:persist:jdk-11 #301586

00:02:23

71.2653%
passed test:backend:persist:jdk-8 #301585

00:02:05

71.1221%
passed test:backend:rest:hsql #301590

00:01:48

3.32092%
passed test:backend:rest:jdk-11 #301589

00:04:17

3.32092%
passed test:backend:rest:jdk-8 #301588

00:02:02

3.32221%
passed test:backend:service:hsql #301593

00:06:35

54.4648%
passed test:backend:service:jdk-11 #301592

00:07:42

54.4648%
passed test:backend:service:jdk-8 #301591

00:05:29

54.4698%
failed test:backend:web:hsql #301596

00:20:19

failed test:backend:web:jdk-11 #301595

00:18:14

failed test:backend:web:jdk-8 #301594

00:19:33

passed test:code_validation #301598

00:05:14

passed test:dependency_conflict #301597

00:04:03

passed test:frontend #301561

00:01:49

84.63%
passed test:mvn_changelog_version_check #301599

00:00:38

passed test_postgres_10_compatibility #301601

00:03:54

passed test_postgres_11_compatibility #301602

00:02:13

passed test_postgres_9_3_compatibility #301600

00:02:18

 
Name Stage Failure
failed
test:backend:annotation:jdk-8 Test
[ERROR] -> [Help 1]
[ERROR]
[ERROR] To see the full stack trace of the errors, re-run Maven with the -e switch.
[ERROR] Re-run Maven using the -X switch to enable full debug logging.
[ERROR]
[ERROR] For more information about the errors and possible solutions, please read the following articles:
[ERROR] [Help 1] http://cwiki.apache.org/confluence/display/MAVEN/MojoFailureException
Cleaning up project directory and file based variables
ERROR: Job failed: exit code 1

failed
test:backend:annotation:jdk-11 Test
[ERROR] -> [Help 1]
[ERROR]
[ERROR] To see the full stack trace of the errors, re-run Maven with the -e switch.
[ERROR] Re-run Maven using the -X switch to enable full debug logging.
[ERROR]
[ERROR] For more information about the errors and possible solutions, please read the following articles:
[ERROR] [Help 1] http://cwiki.apache.org/confluence/display/MAVEN/MojoFailureException
Cleaning up project directory and file based variables
ERROR: Job failed: exit code 1

failed
test:backend:annotation:jdk-11-hsql Test The script exceeded the maximum execution time set for the job
	at java.base/java.net.Socket.connect(Socket.java:591)
at org.apache.commons.net.ftp.FTPClient._openDataConnection_(FTPClient.java:920)
at org.apache.commons.net.ftp.FTPClient._openDataConnection_(FTPClient.java:785)
at org.apache.commons.net.ftp.FTPClient.initiateListParsing(FTPClient.java:3409)
at org.apache.commons.net.ftp.FTPClient.initiateListParsing(FTPClient.java:3339)
at org.apache.commons.net.ftp.FTPClient.listFiles(FTPClient.java:3016)
at lcsb.mapviewer.annotation.services.genome.UcscReferenceGenomeConnector.getGenomeVersionFile(UcscReferenceGenomeConnector.java:242)
... 47 more
ERROR: Job failed: execution took longer than 1h0m0s seconds

failed
test:backend:web:jdk-8 Test
[ERROR] -> [Help 1]
[ERROR]
[ERROR] To see the full stack trace of the errors, re-run Maven with the -e switch.
[ERROR] Re-run Maven using the -X switch to enable full debug logging.
[ERROR]
[ERROR] For more information about the errors and possible solutions, please read the following articles:
[ERROR] [Help 1] http://cwiki.apache.org/confluence/display/MAVEN/MojoFailureException
Cleaning up project directory and file based variables
ERROR: Job failed: exit code 1

failed
test:backend:web:jdk-11 Test
[ERROR] -> [Help 1]
[ERROR]
[ERROR] To see the full stack trace of the errors, re-run Maven with the -e switch.
[ERROR] Re-run Maven using the -X switch to enable full debug logging.
[ERROR]
[ERROR] For more information about the errors and possible solutions, please read the following articles:
[ERROR] [Help 1] http://cwiki.apache.org/confluence/display/MAVEN/MojoFailureException
Cleaning up project directory and file based variables
ERROR: Job failed: exit code 1

failed
test:backend:web:hsql Test
[ERROR] -> [Help 1]
[ERROR]
[ERROR] To see the full stack trace of the errors, re-run Maven with the -e switch.
[ERROR] Re-run Maven using the -X switch to enable full debug logging.
[ERROR]
[ERROR] For more information about the errors and possible solutions, please read the following articles:
[ERROR] [Help 1] http://cwiki.apache.org/confluence/display/MAVEN/MojoFailureException
Cleaning up project directory and file based variables
ERROR: Job failed: exit code 1