Merge remote-tracking branch 'origin/devel_16.0.x' into node-issue

44 jobs for node-issue in 49 minutes and 57 seconds (queued for 32 seconds)
Status Name Job ID Coverage
  Test
passed test:backend:annotation:jdk-11 #301133

00:08:51

90.7177%
passed test:backend:annotation:jdk-11-hsql #301134

00:09:22

90.7752%
passed test:backend:annotation:jdk-8 #301132

00:11:01

90.7173%
passed test:backend:CellDesigner_plugin:jdk-8 #301135

00:03:25

85.1653%
passed test:backend:commons:jdk-11 #301131

00:01:49

84.146%
passed test:backend:commons:jdk-8 #301130

00:01:00

84.146%
passed test:backend:converter_CellDesigner:jdk-11 #301139

00:02:08

95.6333%
passed test:backend:converter_CellDesigner:jdk-8 #301138

00:02:19

95.6327%
passed test:backend:converter_graphics:jdk-11 #301141

00:00:55

73.8091%
passed test:backend:converter_graphics:jdk-8 #301140

00:01:36

73.815%
passed test:backend:converter:jdk-11 #301137

00:00:57

67.5814%
passed test:backend:converter:jdk-8 #301136

00:00:52

67.5522%
passed test:backend:converter_SBGNML:jdk-11 #301143

00:05:58

89.1058%
passed test:backend:converter_SBGNML:jdk-11-hsql #301144

00:05:00

89.1058%
passed test:backend:converter_SBGNML:jdk-8 #301142

00:02:41

89.1046%
passed test:backend:converter_SBML:jdk-11 #301146

00:03:38

90.8917%
passed test:backend:converter_SBML:jdk-8 #301145

00:02:52

90.9022%
passed test:backend:model_command:jdk-11 #301150

00:00:52

76.7991%
passed test:backend:model_command:jdk-8 #301149

00:02:10

76.8095%
passed test:backend:model:jdk-11 #301148

00:00:58

86.1429%
passed test:backend:model:jdk-8 #301147

00:00:56

86.1441%
passed test:backend:pathvisio:jdk-11 #301152

00:01:32

85.2991%
passed test:backend:pathvisio:jdk-8 #301151

00:00:52

85.3012%
passed test:backend:persist:hsql #301155

00:02:11

71.3183%
passed test:backend:persist:jdk-11 #301154

00:01:09

71.3183%
passed test:backend:persist:jdk-8 #301153

00:01:07

71.1743%
passed test:backend:rest:hsql #301158

00:05:29

42.4253%
passed test:backend:rest:jdk-11 #301157

00:07:26

42.4253%
passed test:backend:rest:jdk-8 #301156

00:04:25

42.4165%
passed test:backend:service:hsql #301161

00:04:05

57.1704%
passed test:backend:service:jdk-11 #301160

00:04:10

57.1704%
passed test:backend:service:jdk-8 #301159

00:05:13

57.1764%
failed test:backend:web:hsql #301453

00:32:51

failed test:backend:web:jdk-11 #301451

00:33:37

failed test:backend:web:jdk-8 #301452

00:33:05

passed test:dependency_conflict #301165

00:02:28

passed test:frontend #301129

00:03:41

84.64%
passed test:mvn_changelog_version_check #301166

00:00:28

passed test_postgres_10_compatibility #301168

00:02:55

passed test_postgres_11_compatibility #301169

00:02:18

passed test_postgres_9_3_compatibility #301167

00:02:14

failed test:backend:web:hsql #301164

00:01:12

failed test:backend:web:jdk-11 #301163

00:01:38

failed test:backend:web:jdk-8 #301162

00:00:43

 
Name Stage Failure
failed
test:backend:web:jdk-11 Test
[ERROR] -> [Help 1]
[ERROR]
[ERROR] To see the full stack trace of the errors, re-run Maven with the -e switch.
[ERROR] Re-run Maven using the -X switch to enable full debug logging.
[ERROR]
[ERROR] For more information about the errors and possible solutions, please read the following articles:
[ERROR] [Help 1] http://cwiki.apache.org/confluence/display/MAVEN/MojoFailureException
Cleaning up project directory and file based variables
ERROR: Job failed: exit code 1

failed
test:backend:web:jdk-8 Test
[ERROR] -> [Help 1]
[ERROR]
[ERROR] To see the full stack trace of the errors, re-run Maven with the -e switch.
[ERROR] Re-run Maven using the -X switch to enable full debug logging.
[ERROR]
[ERROR] For more information about the errors and possible solutions, please read the following articles:
[ERROR] [Help 1] http://cwiki.apache.org/confluence/display/MAVEN/MojoFailureException
Cleaning up project directory and file based variables
ERROR: Job failed: exit code 1

failed
test:backend:web:hsql Test
[ERROR] -> [Help 1]
[ERROR]
[ERROR] To see the full stack trace of the errors, re-run Maven with the -e switch.
[ERROR] Re-run Maven using the -X switch to enable full debug logging.
[ERROR]
[ERROR] For more information about the errors and possible solutions, please read the following articles:
[ERROR] [Help 1] http://cwiki.apache.org/confluence/display/MAVEN/MojoFailureException
Cleaning up project directory and file based variables
ERROR: Job failed: exit code 1