Merge remote-tracking branch 'origin/master' into...

Merge remote-tracking branch 'origin/master' into 1529-introduce-uniform-checkstyle-validation-as-gitlab-job
42 jobs for 1529-introduce-uniform-checkstyle-validation-as-gitlab-job in 12 minutes and 29 seconds (queued for 1 minute and 7 seconds)
Status Name Job ID Coverage
  Test
passed test:backend:annotation:jdk-11 #293468

00:10:25

88.3471%
passed test:backend:annotation:jdk-11-hsql #293469

00:10:03

88.3471%
passed test:backend:annotation:jdk-8 #293467

00:10:15

88.3467%
passed test:backend:CellDesigner_plugin:jdk-8 #293470

00:02:02

85.1653%
passed test:backend:commons:jdk-11 #293466

00:02:56

84.5228%
passed test:backend:commons:jdk-8 #293465

00:02:16

84.5228%
passed test:backend:converter_CellDesigner:jdk-11 #293474

00:01:54

95.6634%
passed test:backend:converter_CellDesigner:jdk-8 #293473

00:03:19

95.6327%
passed test:backend:converter_graphics:jdk-11 #293476

00:02:48

73.8091%
passed test:backend:converter_graphics:jdk-8 #293475

00:01:30

73.815%
passed test:backend:converter:jdk-11 #293472

00:02:42

65.5993%
passed test:backend:converter:jdk-8 #293471

00:02:32

65.571%
passed test:backend:converter_SBGNML:jdk-11 #293478

00:04:26

89.1058%
passed test:backend:converter_SBGNML:jdk-11-hsql #293479

00:05:28

89.1058%
passed test:backend:converter_SBGNML:jdk-8 #293477

00:03:37

89.1046%
passed test:backend:converter_SBML:jdk-11 #293481

00:02:25

90.9033%
passed test:backend:converter_SBML:jdk-8 #293480

00:02:14

90.9022%
passed test:backend:model_command:jdk-11 #293485

00:02:39

76.7991%
passed test:backend:model_command:jdk-8 #293484

00:01:45

76.8095%
passed test:backend:model:jdk-11 #293483

00:01:25

80.9503%
passed test:backend:model:jdk-8 #293482

00:02:37

80.9519%
passed test:backend:pathvisio:jdk-11 #293487

00:02:08

85.2991%
passed test:backend:pathvisio:jdk-8 #293486

00:01:27

85.3012%
passed test:backend:persist:hsql #293490

00:03:19

71.0135%
passed test:backend:persist:jdk-11 #293489

00:03:18

71.0135%
passed test:backend:persist:jdk-8 #293488

00:01:45

70.8712%
failed test:backend:rest:hsql #293493

00:01:40

failed test:backend:rest:jdk-11 #293492

00:02:01

failed test:backend:rest:jdk-8 #293491

00:00:56

passed test:backend:service:hsql #293496

00:06:29

54.4001%
passed test:backend:service:jdk-11 #293495

00:05:13

54.4001%
passed test:backend:service:jdk-8 #293494

00:04:53

54.4051%
failed test:backend:web:hsql #293499

00:02:18

failed test:backend:web:jdk-11 #293498

00:02:10

failed test:backend:web:jdk-8 #293497

00:02:38

failed test:code_validation #293501

00:02:29

failed test:dependency_conflict #293500

00:01:52

passed test:frontend #293464

00:02:27

84.66%
passed test:mvn_changelog_version_check #293502

00:00:29

passed test_postgres_10_compatibility #293504

00:03:08

passed test_postgres_11_compatibility #293505

00:02:26

passed test_postgres_9_3_compatibility #293503

00:02:29

 
Name Stage Failure
failed
test:backend:rest:jdk-11 Test
[ERROR] To see the full stack trace of the errors, re-run Maven with the -e switch.
[ERROR] Re-run Maven using the -X switch to enable full debug logging.
[ERROR]
[ERROR] For more information about the errors and possible solutions, please read the following articles:
[ERROR] [Help 1] http://cwiki.apache.org/confluence/display/MAVEN/MojoExecutionException
[ERROR]
[ERROR] After correcting the problems, you can resume the build with the command
[ERROR] mvn <goals> -rf :rest-api
Cleaning up file based variables
ERROR: Job failed: exit code 1
failed
test:backend:rest:hsql Test
[ERROR] To see the full stack trace of the errors, re-run Maven with the -e switch.
[ERROR] Re-run Maven using the -X switch to enable full debug logging.
[ERROR]
[ERROR] For more information about the errors and possible solutions, please read the following articles:
[ERROR] [Help 1] http://cwiki.apache.org/confluence/display/MAVEN/MojoExecutionException
[ERROR]
[ERROR] After correcting the problems, you can resume the build with the command
[ERROR] mvn <goals> -rf :rest-api
Cleaning up file based variables
ERROR: Job failed: exit code 1
failed
test:backend:web:jdk-8 Test
[ERROR] To see the full stack trace of the errors, re-run Maven with the -e switch.
[ERROR] Re-run Maven using the -X switch to enable full debug logging.
[ERROR]
[ERROR] For more information about the errors and possible solutions, please read the following articles:
[ERROR] [Help 1] http://cwiki.apache.org/confluence/display/MAVEN/MojoExecutionException
[ERROR]
[ERROR] After correcting the problems, you can resume the build with the command
[ERROR] mvn <goals> -rf :rest-api
Cleaning up file based variables
ERROR: Job failed: exit code 1
failed
test:code_validation Test
[ERROR] To see the full stack trace of the errors, re-run Maven with the -e switch.
[ERROR] Re-run Maven using the -X switch to enable full debug logging.
[ERROR]
[ERROR] For more information about the errors and possible solutions, please read the following articles:
[ERROR] [Help 1] http://cwiki.apache.org/confluence/display/MAVEN/MojoExecutionException
[ERROR]
[ERROR] After correcting the problems, you can resume the build with the command
[ERROR] mvn <goals> -rf :rest-api
Cleaning up file based variables
ERROR: Job failed: exit code 1
failed
test:backend:rest:jdk-8 Test
[ERROR] To see the full stack trace of the errors, re-run Maven with the -e switch.
[ERROR] Re-run Maven using the -X switch to enable full debug logging.
[ERROR]
[ERROR] For more information about the errors and possible solutions, please read the following articles:
[ERROR] [Help 1] http://cwiki.apache.org/confluence/display/MAVEN/MojoExecutionException
[ERROR]
[ERROR] After correcting the problems, you can resume the build with the command
[ERROR] mvn <goals> -rf :rest-api
Cleaning up file based variables
ERROR: Job failed: exit code 1
failed
test:backend:web:jdk-11 Test
[ERROR] To see the full stack trace of the errors, re-run Maven with the -e switch.
[ERROR] Re-run Maven using the -X switch to enable full debug logging.
[ERROR]
[ERROR] For more information about the errors and possible solutions, please read the following articles:
[ERROR] [Help 1] http://cwiki.apache.org/confluence/display/MAVEN/MojoExecutionException
[ERROR]
[ERROR] After correcting the problems, you can resume the build with the command
[ERROR] mvn <goals> -rf :rest-api
Cleaning up file based variables
ERROR: Job failed: exit code 1
failed
test:backend:web:hsql Test
[ERROR] To see the full stack trace of the errors, re-run Maven with the -e switch.
[ERROR] Re-run Maven using the -X switch to enable full debug logging.
[ERROR]
[ERROR] For more information about the errors and possible solutions, please read the following articles:
[ERROR] [Help 1] http://cwiki.apache.org/confluence/display/MAVEN/MojoExecutionException
[ERROR]
[ERROR] After correcting the problems, you can resume the build with the command
[ERROR] mvn <goals> -rf :rest-api
Cleaning up file based variables
ERROR: Job failed: exit code 1
failed
test:dependency_conflict Test
[ERROR] To see the full stack trace of the errors, re-run Maven with the -e switch.
[ERROR] Re-run Maven using the -X switch to enable full debug logging.
[ERROR]
[ERROR] For more information about the errors and possible solutions, please read the following articles:
[ERROR] [Help 1] http://cwiki.apache.org/confluence/display/MAVEN/MojoExecutionException
[ERROR]
[ERROR] After correcting the problems, you can resume the build with the command
[ERROR] mvn <goals> -rf :rest-api
Cleaning up file based variables
ERROR: Job failed: exit code 1