data overlays are processed properly in zip file

41 jobs for 1485-general-overlay-is-not-displayed in 25 minutes (queued for 7 seconds)
Status Name Job ID Coverage
  Test
failed test:backend:annotation:jdk-11 #264679

00:10:39

failed test:backend:annotation:jdk-11-hsql #264680

00:09:14

failed test:backend:annotation:jdk-8 #264678

00:09:22

passed test:backend:CellDesigner_plugin:jdk-8 #264681

00:02:49

85.1653%
passed test:backend:commons:jdk-11 #264677

00:03:06

84.146%
passed test:backend:commons:jdk-8 #264676

00:03:51

84.146%
passed test:backend:converter_CellDesigner:jdk-11 #264685

00:03:27

95.6333%
passed test:backend:converter_CellDesigner:jdk-8 #264684

00:05:23

95.6327%
passed test:backend:converter_graphics:jdk-11 #264687

00:02:26

73.8091%
passed test:backend:converter_graphics:jdk-8 #264686

00:02:25

73.815%
passed test:backend:converter:jdk-11 #264683

00:01:41

67.5814%
passed test:backend:converter:jdk-8 #264682

00:03:47

67.5522%
passed test:backend:converter_SBGNML:jdk-11 #264689

00:08:37

89.1058%
passed test:backend:converter_SBGNML:jdk-11-hsql #264690

00:09:18

89.1058%
passed test:backend:converter_SBGNML:jdk-8 #264688

00:08:06

89.1046%
passed test:backend:converter_SBML:jdk-11 #264692

00:06:59

90.9033%
passed test:backend:converter_SBML:jdk-8 #264691

00:04:44

90.9022%
passed test:backend:model_command:jdk-11 #264696

00:02:09

76.8707%
passed test:backend:model_command:jdk-8 #264695

00:02:21

76.8812%
passed test:backend:model:jdk-11 #264694

00:04:58

86.1499%
passed test:backend:model:jdk-8 #264693

00:04:39

86.1511%
passed test:backend:pathvisio:jdk-11 #264698

00:02:52

85.2991%
passed test:backend:pathvisio:jdk-8 #264697

00:02:42

85.3012%
passed test:backend:persist:hsql #264701

00:04:30

71.0817%
passed test:backend:persist:jdk-11 #264700

00:02:56

71.0817%
passed test:backend:persist:jdk-8 #264699

00:02:51

70.9387%
passed test:backend:rest:hsql #264704

00:12:56

42.624%
failed test:backend:rest:jdk-11 #264703

00:09:36

passed test:backend:rest:jdk-8 #264702

00:11:07

42.615%
passed test:backend:service:hsql #264707

00:06:32

57.2596%
passed test:backend:service:jdk-11 #264706

00:11:13

57.2596%
passed test:backend:service:jdk-8 #264705

00:07:22

57.2656%
passed test:backend:web:hsql #264710

00:20:19

47.3546%
passed test:backend:web:jdk-11 #264709

00:15:27

47.3546%
passed test:backend:web:jdk-8 #264708

00:15:42

47.3546%
passed test:dependency_conflict #264711

00:04:54

passed test:frontend #264675

00:03:58

84.96%
failed test:mvn_changelog_version_check #264712

00:00:39

passed test_postgres_10_compatibility #264714

00:03:54

passed test_postgres_11_compatibility #264715

00:04:46

passed test_postgres_9_3_compatibility #264713

00:03:10

 
Name Stage Failure
failed
test:backend:annotation:jdk-8 Test
[ERROR] -> [Help 1]
[ERROR]
[ERROR] To see the full stack trace of the errors, re-run Maven with the -e switch.
[ERROR] Re-run Maven using the -X switch to enable full debug logging.
[ERROR]
[ERROR] For more information about the errors and possible solutions, please read the following articles:
[ERROR] [Help 1] http://cwiki.apache.org/confluence/display/MAVEN/MojoFailureException
Cleaning up file based variables
ERROR: Job failed: exit code 1
failed
test:backend:annotation:jdk-11 Test
[ERROR] -> [Help 1]
[ERROR]
[ERROR] To see the full stack trace of the errors, re-run Maven with the -e switch.
[ERROR] Re-run Maven using the -X switch to enable full debug logging.
[ERROR]
[ERROR] For more information about the errors and possible solutions, please read the following articles:
[ERROR] [Help 1] http://cwiki.apache.org/confluence/display/MAVEN/MojoFailureException
Cleaning up file based variables
ERROR: Job failed: exit code 1
failed
test:backend:annotation:jdk-11-hsql Test
[ERROR] -> [Help 1]
[ERROR]
[ERROR] To see the full stack trace of the errors, re-run Maven with the -e switch.
[ERROR] Re-run Maven using the -X switch to enable full debug logging.
[ERROR]
[ERROR] For more information about the errors and possible solutions, please read the following articles:
[ERROR] [Help 1] http://cwiki.apache.org/confluence/display/MAVEN/MojoFailureException
Cleaning up file based variables
ERROR: Job failed: exit code 1
failed
test:backend:rest:jdk-11 Test
[ERROR] -> [Help 1]
[ERROR]
[ERROR] To see the full stack trace of the errors, re-run Maven with the -e switch.
[ERROR] Re-run Maven using the -X switch to enable full debug logging.
[ERROR]
[ERROR] For more information about the errors and possible solutions, please read the following articles:
[ERROR] [Help 1] http://cwiki.apache.org/confluence/display/MAVEN/MojoExecutionException
Cleaning up file based variables
ERROR: Job failed: exit code 1
failed
test:mvn_changelog_version_check Test
$ changelog_version=`cat CHANGELOG |grep minerva |head -1 | cut -f2 -d'(' | cut -f1 -d')'`
$ echo "Maven version:" $mvn_version
Maven version: 16.0.0~beta.0
$ echo "Changelog version:" $changelog_version
Changelog version: 16.0.0~beta.1
$ set -e
$ test $mvn_version = $changelog_version
Cleaning up file based variables
ERROR: Job failed: exit code 1