scalling glyph does not introduce lost in quality

41 jobs for 1458-glyphs-are-displayed-in-a-suboptimal-resolution in 27 minutes and 36 seconds (queued for 10 seconds)
Status Name Job ID Coverage
  Test
passed test:backend:annotation:jdk-11 #247454

00:11:02

90.6625%
passed test:backend:annotation:jdk-11-hsql #247455

00:10:40

90.6625%
passed test:backend:annotation:jdk-8 #247453

00:10:26

90.6621%
passed test:backend:CellDesigner_plugin:jdk-8 #247456

00:05:11

85.1521%
passed test:backend:commons:jdk-11 #247452

00:04:18

84.146%
passed test:backend:commons:jdk-8 #247451

00:04:04

84.146%
passed test:backend:converter_CellDesigner:jdk-11 #247460

00:03:49

95.6598%
passed test:backend:converter_CellDesigner:jdk-8 #247459

00:03:05

95.6291%
failed test:backend:converter_graphics:jdk-11 #247462

00:02:46

failed test:backend:converter_graphics:jdk-8 #247461

00:04:22

passed test:backend:converter:jdk-11 #247458

00:02:21

62.2272%
passed test:backend:converter:jdk-8 #247457

00:02:06

62.1992%
passed test:backend:converter_SBGNML:jdk-11 #247464

00:08:10

89.0997%
passed test:backend:converter_SBGNML:jdk-11-hsql #247465

00:10:31

89.0997%
passed test:backend:converter_SBGNML:jdk-8 #247463

00:05:48

89.0985%
passed test:backend:converter_SBML:jdk-11 #247467

00:06:54

90.7544%
passed test:backend:converter_SBML:jdk-8 #247466

00:06:57

90.7417%
passed test:backend:model_command:jdk-11 #247471

00:02:24

76.8707%
passed test:backend:model_command:jdk-8 #247470

00:02:47

76.8812%
passed test:backend:model:jdk-11 #247469

00:05:06

86.1499%
passed test:backend:model:jdk-8 #247468

00:04:55

86.1511%
passed test:backend:pathvisio:jdk-11 #247473

00:02:56

85.2991%
passed test:backend:pathvisio:jdk-8 #247472

00:02:33

85.3012%
passed test:backend:persist:hsql #247476

00:05:57

71.0817%
passed test:backend:persist:jdk-11 #247475

00:03:18

71.0817%
passed test:backend:persist:jdk-8 #247474

00:03:32

70.9387%
passed test:backend:rest:hsql #247479

00:15:23

42.6136%
passed test:backend:rest:jdk-11 #247478

00:10:12

42.6136%
passed test:backend:rest:jdk-8 #247477

00:12:37

42.6047%
passed test:backend:service:hsql #247482

00:08:36

60.2264%
passed test:backend:service:jdk-11 #247481

00:12:01

60.2264%
passed test:backend:service:jdk-8 #247480

00:12:44

60.2265%
passed test:backend:web:hsql #247485

00:22:28

47.3546%
passed test:backend:web:jdk-11 #247484

00:20:06

47.3546%
passed test:backend:web:jdk-8 #247483

00:22:11

47.3546%
passed test:dependency_conflict #247486

00:11:17

failed test:frontend #247450

00:06:18

85.18%
passed test:mvn_changelog_version_check #247487

00:00:34

passed test_postgres_10_compatibility #247489

00:06:44

passed test_postgres_11_compatibility #247490

00:03:51

passed test_postgres_9_3_compatibility #247488

00:03:56

 
Name Stage Failure
failed
test:backend:converter_graphics:jdk-8 Test
[ERROR] -> [Help 1]
[ERROR]
[ERROR] To see the full stack trace of the errors, re-run Maven with the -e switch.
[ERROR] Re-run Maven using the -X switch to enable full debug logging.
[ERROR]
[ERROR] For more information about the errors and possible solutions, please read the following articles:
[ERROR] [Help 1] http://cwiki.apache.org/confluence/display/MAVEN/MojoFailureException
Cleaning up file based variables
ERROR: Job failed: exit code 1
failed
test:frontend Test
=============================== Coverage summary ===============================
Statements : 85.18% ( 16503/19375 )
Branches : 68.78% ( 3261/4741 )
Functions : 81.95% ( 3079/3757 )
Lines : 85.23% ( 16499/19359 )
================================================================================
npm ERR! Test failed. See above for more details.
Cleaning up file based variables
ERROR: Job failed: exit code 1
failed
test:backend:converter_graphics:jdk-11 Test
[ERROR] -> [Help 1]
[ERROR]
[ERROR] To see the full stack trace of the errors, re-run Maven with the -e switch.
[ERROR] Re-run Maven using the -X switch to enable full debug logging.
[ERROR]
[ERROR] For more information about the errors and possible solutions, please read the following articles:
[ERROR] [Help 1] http://cwiki.apache.org/confluence/display/MAVEN/MojoFailureException
Cleaning up file based variables
ERROR: Job failed: exit code 1