scalling glyph does not introduce lost in quality

41 jobs for 1458-glyphs-are-displayed-in-a-suboptimal-resolution in 27 minutes and 36 seconds (queued for 10 seconds)
Status Job ID Name Coverage
  Test
passed #247454
test:backend:annotation:jdk-11

00:11:02

90.6625%
passed #247455
test:backend:annotation:jdk-11-hsql

00:10:40

90.6625%
passed #247453
test:backend:annotation:jdk-8

00:10:26

90.6621%
passed #247456
test:backend:CellDesigner_plugin:jdk-8

00:05:11

85.1521%
passed #247452
test:backend:commons:jdk-11

00:04:18

84.146%
passed #247451
test:backend:commons:jdk-8

00:04:04

84.146%
passed #247460
test:backend:converter_CellDesigner:jdk-11

00:03:49

95.6598%
passed #247459
test:backend:converter_CellDesigner:jdk-8

00:03:05

95.6291%
failed #247462
test:backend:converter_graphics:jdk-11

00:02:46

failed #247461
test:backend:converter_graphics:jdk-8

00:04:22

passed #247458
test:backend:converter:jdk-11

00:02:21

62.2272%
passed #247457
test:backend:converter:jdk-8

00:02:06

62.1992%
passed #247464
test:backend:converter_SBGNML:jdk-11

00:08:10

89.0997%
passed #247465
test:backend:converter_SBGNML:jdk-11-hsql

00:10:31

89.0997%
passed #247463
test:backend:converter_SBGNML:jdk-8

00:05:48

89.0985%
passed #247467
test:backend:converter_SBML:jdk-11

00:06:54

90.7544%
passed #247466
test:backend:converter_SBML:jdk-8

00:06:57

90.7417%
passed #247471
test:backend:model_command:jdk-11

00:02:24

76.8707%
passed #247470
test:backend:model_command:jdk-8

00:02:47

76.8812%
passed #247469
test:backend:model:jdk-11

00:05:06

86.1499%
passed #247468
test:backend:model:jdk-8

00:04:55

86.1511%
passed #247473
test:backend:pathvisio:jdk-11

00:02:56

85.2991%
passed #247472
test:backend:pathvisio:jdk-8

00:02:33

85.3012%
passed #247476
test:backend:persist:hsql

00:05:57

71.0817%
passed #247475
test:backend:persist:jdk-11

00:03:18

71.0817%
passed #247474
test:backend:persist:jdk-8

00:03:32

70.9387%
passed #247479
test:backend:rest:hsql

00:15:23

42.6136%
passed #247478
test:backend:rest:jdk-11

00:10:12

42.6136%
passed #247477
test:backend:rest:jdk-8

00:12:37

42.6047%
passed #247482
test:backend:service:hsql

00:08:36

60.2264%
passed #247481
test:backend:service:jdk-11

00:12:01

60.2264%
passed #247480
test:backend:service:jdk-8

00:12:44

60.2265%
passed #247485
test:backend:web:hsql

00:22:28

47.3546%
passed #247484
test:backend:web:jdk-11

00:20:06

47.3546%
passed #247483
test:backend:web:jdk-8

00:22:11

47.3546%
passed #247486
test:dependency_conflict

00:11:17

failed #247450
test:frontend

00:06:18

85.18%
passed #247487
test:mvn_changelog_version_check

00:00:34

passed #247489
test_postgres_10_compatibility

00:06:44

passed #247490
test_postgres_11_compatibility

00:03:51

passed #247488
test_postgres_9_3_compatibility

00:03:56

 
Name Stage Failure
failed
test:frontend Test
=============================== Coverage summary ===============================
Statements : 85.18% ( 16503/19375 )
Branches : 68.78% ( 3261/4741 )
Functions : 81.95% ( 3079/3757 )
Lines : 85.23% ( 16499/19359 )
================================================================================
npm ERR! Test failed. See above for more details.
Cleaning up file based variables
ERROR: Job failed: exit code 1
failed
test:backend:converter_graphics:jdk-8 Test
[ERROR] -> [Help 1]
[ERROR]
[ERROR] To see the full stack trace of the errors, re-run Maven with the -e switch.
[ERROR] Re-run Maven using the -X switch to enable full debug logging.
[ERROR]
[ERROR] For more information about the errors and possible solutions, please read the following articles:
[ERROR] [Help 1] http://cwiki.apache.org/confluence/display/MAVEN/MojoFailureException
Cleaning up file based variables
ERROR: Job failed: exit code 1
failed
test:backend:converter_graphics:jdk-11 Test
[ERROR] -> [Help 1]
[ERROR]
[ERROR] To see the full stack trace of the errors, re-run Maven with the -e switch.
[ERROR] Re-run Maven using the -X switch to enable full debug logging.
[ERROR]
[ERROR] For more information about the errors and possible solutions, please read the following articles:
[ERROR] [Help 1] http://cwiki.apache.org/confluence/display/MAVEN/MojoFailureException
Cleaning up file based variables
ERROR: Job failed: exit code 1