migration scripts were moved to another folder

41 jobs for debian-package-issues in 15 minutes and 18 seconds (queued for 8 seconds)
Status Name Job ID Coverage
  Test
passed test:backend:annotation:jdk-11 #240483

00:13:36

90.6625%
passed test:backend:annotation:jdk-11-hsql #240484

00:10:23

90.6625%
passed test:backend:annotation:jdk-8 #240482

00:10:39

90.6621%
passed test:backend:CellDesigner_plugin:jdk-8 #240485

00:04:51

86.2254%
passed test:backend:commons:jdk-11 #240481

00:03:53

84.3724%
passed test:backend:commons:jdk-8 #240480

00:03:43

84.3724%
passed test:backend:converter_CellDesigner:jdk-11 #240489

00:03:27

95.6598%
passed test:backend:converter_CellDesigner:jdk-8 #240488

00:03:20

95.6291%
passed test:backend:converter_graphics:jdk-11 #240491

00:02:44

73.6589%
passed test:backend:converter_graphics:jdk-8 #240490

00:02:29

73.6648%
passed test:backend:converter:jdk-11 #240487

00:02:08

61.9123%
passed test:backend:converter:jdk-8 #240486

00:02:06

62.1992%
passed test:backend:converter_SBGNML:jdk-11 #240493

00:08:08

89.0997%
passed test:backend:converter_SBGNML:jdk-11-hsql #240494

00:07:45

89.0997%
passed test:backend:converter_SBGNML:jdk-8 #240492

00:05:26

89.0985%
passed test:backend:converter_SBML:jdk-11 #240496

00:06:59

90.7544%
passed test:backend:converter_SBML:jdk-8 #240495

00:04:26

90.7533%
passed test:backend:model_command:jdk-11 #240500

00:02:34

76.8584%
passed test:backend:model_command:jdk-8 #240499

00:04:12

76.8812%
passed test:backend:model:jdk-11 #240498

00:04:45

86.1499%
passed test:backend:model:jdk-8 #240497

00:04:18

86.1511%
passed test:backend:pathvisio:jdk-11 #240502

00:02:42

85.2991%
passed test:backend:pathvisio:jdk-8 #240501

00:02:38

85.3012%
passed test:backend:persist:hsql #240505

00:03:12

71.3494%
passed test:backend:persist:jdk-11 #240504

00:03:27

71.3494%
passed test:backend:persist:jdk-8 #240503

00:03:24

71.2048%
failed test:backend:rest:hsql #240508

00:10:23

canceled test:backend:rest:jdk-11 #240507

00:11:22

canceled test:backend:rest:jdk-8 #240506

00:11:32

passed test:backend:service:hsql #240511

00:10:20

60.2348%
passed test:backend:service:jdk-11 #240510

00:08:41

60.2348%
passed test:backend:service:jdk-8 #240509

00:07:23

60.2349%
canceled test:backend:web:hsql #240514

00:10:03

canceled test:backend:web:jdk-11 #240513

00:10:24

canceled test:backend:web:jdk-8 #240512

00:10:28

passed test:dependency_conflict #240515

00:10:31

failed test:frontend #240479

00:06:20

85.18%
passed test:mvn_changelog_version_check #240516

00:00:59

passed test_postgres_10_compatibility #240518

00:06:16

passed test_postgres_11_compatibility #240519

00:03:37

passed test_postgres_9_3_compatibility #240517

00:06:48

 
Name Stage Failure
failed
test:backend:rest:hsql Test
[ERROR] -> [Help 1]
[ERROR]
[ERROR] To see the full stack trace of the errors, re-run Maven with the -e switch.
[ERROR] Re-run Maven using the -X switch to enable full debug logging.
[ERROR]
[ERROR] For more information about the errors and possible solutions, please read the following articles:
[ERROR] [Help 1] http://cwiki.apache.org/confluence/display/MAVEN/MojoExecutionException
Cleaning up file based variables
ERROR: Job failed: exit code 1
failed
test:frontend Test
=============================== Coverage summary ===============================
Statements : 85.18% ( 16503/19375 )
Branches : 68.78% ( 3261/4741 )
Functions : 81.95% ( 3079/3757 )
Lines : 85.23% ( 16499/19359 )
================================================================================
npm ERR! Test failed. See above for more details.
Cleaning up file based variables
ERROR: Job failed: exit code 1