migration scripts were moved to another folder

41 jobs for debian-package-issues in 15 minutes and 18 seconds (queued for 8 seconds)
Status Job ID Name Coverage
  Test
passed #240483
test:backend:annotation:jdk-11

00:13:36

90.6625%
passed #240484
test:backend:annotation:jdk-11-hsql

00:10:23

90.6625%
passed #240482
test:backend:annotation:jdk-8

00:10:39

90.6621%
passed #240485
test:backend:CellDesigner_plugin:jdk-8

00:04:51

86.2254%
passed #240481
test:backend:commons:jdk-11

00:03:53

84.3724%
passed #240480
test:backend:commons:jdk-8

00:03:43

84.3724%
passed #240489
test:backend:converter_CellDesigner:jdk-11

00:03:27

95.6598%
passed #240488
test:backend:converter_CellDesigner:jdk-8

00:03:20

95.6291%
passed #240491
test:backend:converter_graphics:jdk-11

00:02:44

73.6589%
passed #240490
test:backend:converter_graphics:jdk-8

00:02:29

73.6648%
passed #240487
test:backend:converter:jdk-11

00:02:08

61.9123%
passed #240486
test:backend:converter:jdk-8

00:02:06

62.1992%
passed #240493
test:backend:converter_SBGNML:jdk-11

00:08:08

89.0997%
passed #240494
test:backend:converter_SBGNML:jdk-11-hsql

00:07:45

89.0997%
passed #240492
test:backend:converter_SBGNML:jdk-8

00:05:26

89.0985%
passed #240496
test:backend:converter_SBML:jdk-11

00:06:59

90.7544%
passed #240495
test:backend:converter_SBML:jdk-8

00:04:26

90.7533%
passed #240500
test:backend:model_command:jdk-11

00:02:34

76.8584%
passed #240499
test:backend:model_command:jdk-8

00:04:12

76.8812%
passed #240498
test:backend:model:jdk-11

00:04:45

86.1499%
passed #240497
test:backend:model:jdk-8

00:04:18

86.1511%
passed #240502
test:backend:pathvisio:jdk-11

00:02:42

85.2991%
passed #240501
test:backend:pathvisio:jdk-8

00:02:38

85.3012%
passed #240505
test:backend:persist:hsql

00:03:12

71.3494%
passed #240504
test:backend:persist:jdk-11

00:03:27

71.3494%
passed #240503
test:backend:persist:jdk-8

00:03:24

71.2048%
failed #240508
test:backend:rest:hsql

00:10:23

canceled #240507
test:backend:rest:jdk-11

00:11:22

canceled #240506
test:backend:rest:jdk-8

00:11:32

passed #240511
test:backend:service:hsql

00:10:20

60.2348%
passed #240510
test:backend:service:jdk-11

00:08:41

60.2348%
passed #240509
test:backend:service:jdk-8

00:07:23

60.2349%
canceled #240514
test:backend:web:hsql

00:10:03

canceled #240513
test:backend:web:jdk-11

00:10:24

canceled #240512
test:backend:web:jdk-8

00:10:28

passed #240515
test:dependency_conflict

00:10:31

failed #240479
test:frontend

00:06:20

85.18%
passed #240516
test:mvn_changelog_version_check

00:00:59

passed #240518
test_postgres_10_compatibility

00:06:16

passed #240519
test_postgres_11_compatibility

00:03:37

passed #240517
test_postgres_9_3_compatibility

00:06:48

 
Name Stage Failure
failed
test:backend:rest:hsql Test
[ERROR] -> [Help 1]
[ERROR]
[ERROR] To see the full stack trace of the errors, re-run Maven with the -e switch.
[ERROR] Re-run Maven using the -X switch to enable full debug logging.
[ERROR]
[ERROR] For more information about the errors and possible solutions, please read the following articles:
[ERROR] [Help 1] http://cwiki.apache.org/confluence/display/MAVEN/MojoExecutionException
Cleaning up file based variables
ERROR: Job failed: exit code 1
failed
test:frontend Test
=============================== Coverage summary ===============================
Statements : 85.18% ( 16503/19375 )
Branches : 68.78% ( 3261/4741 )
Functions : 81.95% ( 3079/3757 )
Lines : 85.23% ( 16499/19359 )
================================================================================
npm ERR! Test failed. See above for more details.
Cleaning up file based variables
ERROR: Job failed: exit code 1