don't set name for reaction if name is not present

41 jobs for 1007-get-rid-of-custom-map-caching-in-service-layer in 65 minutes (queued for 10 seconds)
Status Job ID Name Coverage
  Test
passed #226241
test:backend:annotation:jdk-11

00:09:57

90.6833%
passed #226242
test:backend:annotation:jdk-11-hsql

00:10:27

90.6833%
passed #226240
test:backend:annotation:jdk-8

00:11:04

90.6829%
passed #226243
test:backend:CellDesigner_plugin:jdk-8

00:04:01

86.2254%
passed #226239
test:backend:commons:jdk-11

00:02:41

84.3724%
passed #226238
test:backend:commons:jdk-8

00:02:41

84.3724%
passed #226247
test:backend:converter_CellDesigner:jdk-11

00:02:45

95.6598%
passed #226246
test:backend:converter_CellDesigner:jdk-8

00:02:36

95.6592%
passed #226249
test:backend:converter_graphics:jdk-11

00:03:33

73.6526%
passed #226248
test:backend:converter_graphics:jdk-8

00:03:23

73.6585%
passed #226245
test:backend:converter:jdk-11

00:01:43

61.9123%
passed #226244
test:backend:converter:jdk-8

00:01:24

62.1992%
passed #226251
test:backend:converter_SBGNML:jdk-11

00:06:35

89.0507%
passed #226252
test:backend:converter_SBGNML:jdk-11-hsql

00:05:56

89.0507%
passed #226250
test:backend:converter_SBGNML:jdk-8

00:04:32

89.0494%
passed #226254
test:backend:converter_SBML:jdk-11

00:03:38

89.7105%
passed #226253
test:backend:converter_SBML:jdk-8

00:03:22

89.7091%
passed #226258
test:backend:model_command:jdk-11

00:02:10

76.8422%
passed #226257
test:backend:model_command:jdk-8

00:01:38

76.8527%
passed #226256
test:backend:model:jdk-11

00:02:02

86.089%
passed #226255
test:backend:model:jdk-8

00:02:02

86.0902%
failed #226260
test:backend:pathvisio:jdk-11

00:03:51

failed #226259
test:backend:pathvisio:jdk-8

00:02:41

passed #226263
test:backend:persist:hsql

00:04:27

72.3397%
passed #226262
test:backend:persist:jdk-11

00:02:46

72.3397%
passed #226261
test:backend:persist:jdk-8

00:02:48

72.1862%
passed #226266
test:backend:rest:hsql

00:08:53

42.8819%
passed #226265
test:backend:rest:jdk-11

00:09:03

42.8819%
passed #226264
test:backend:rest:jdk-8

00:07:57

42.8729%
passed #226269
test:backend:service:hsql

00:08:36

60.2375%
passed #226268
test:backend:service:jdk-11

00:06:32

60.1813%
passed #226267
test:backend:service:jdk-8

00:06:13

60.1813%
failed #226272
test:backend:web:hsql

01:00:01

failed #226271
test:backend:web:jdk-11

01:00:01

failed #226270
test:backend:web:jdk-8

01:00:04

passed #226273
test:dependency_conflict

00:05:14

failed #226237
test:frontend

00:05:49

85.43%
passed #226274
test:mvn_changelog_version_check

00:00:23

failed #226276
test_postgres_10_compatibility

01:00:01

failed #226277
test_postgres_11_compatibility

01:00:01

failed #226275
test_postgres_9_3_compatibility

01:00:13

 
Name Stage Failure
failed
test_postgres_11_compatibility Test The script exceeded the maximum execution time set for the job
	at org.flywaydb.core.Flyway.migrate(Flyway.java:1356) ~[flyway-core-5.2.4.jar:?]
at lcsb.mapviewer.persist.CustomDatabasePopulator.populate(CustomDatabasePopulator.java:51) ~[classes/:?]
at org.springframework.jdbc.datasource.init.DatabasePopulatorUtils.execute(DatabasePopulatorUtils.java:48) ~[spring-jdbc-5.0.9.RELEASE.jar:5.0.9.RELEASE]
at org.springframework.jdbc.datasource.init.DataSourceInitializer.execute(DataSourceInitializer.java:111) ~[spring-jdbc-5.0.9.RELEASE.jar:5.0.9.RELEASE]
at org.springframework.jdbc.datasource.init.DataSourceInitializer.afterPropertiesSet(DataSourceInitializer.java:96) ~[spring-jdbc-5.0.9.RELEASE.jar:5.0.9.RELEASE]
at org.springframework.beans.factory.support.AbstractAutowireCapableBeanFactory.invokeInitMethods(AbstractAutowireCapableBeanFactory.java:1758) ~[spring-beans-5.0.9.RELEASE.jar:5.0.9.RELEASE]
at org.springframework.beans.factory.support.AbstractAutowireCapableBeanFactory.initializeBean(AbstractAutowireCapableBeanFactory.java:1695) ~[spring-beans-5.0.9.RELEASE.jar:5.0.9.RELEASE]
at org.springframework.beans.factory.support.AbstractAutowireCapableBeanFactory.doCreateBean(AbstractAutowireCapableBeanFactory.java:573) ~[spring-beans-5.0.9.RELEASE.jar:5.0.9.RELEASE]
at org.springframework.beans.factory.support.
Job's log exceeded limit of 16777216 bytes.
failed
test_postgres_9_3_compatibility Test The script exceeded the maximum execution time set for the job
	at org.postgresql.jdbc.PgStatement.execute(PgStatement.java:266) ~[postgresql-42.2.5.jar:42.2.5]
at org.flywaydb.core.internal.jdbc.JdbcTemplate.executeStatement(JdbcTemplate.java:235) ~[flyway-core-5.2.4.jar:?]
at org.flywaydb.core.internal.sqlscript.StandardSqlStatement.execute(StandardSqlStatement.java:42) ~[flyway-core-5.2.4.jar:?]
at org.flywaydb.core.internal.sqlscript.DefaultSqlScriptExecutor.executeStatement(DefaultSqlScriptExecutor.java:189) ~[flyway-core-5.2.4.jar:?]
at org.flywaydb.core.internal.sqlscript.DefaultSqlScriptExecutor.execute(DefaultSqlScriptExecutor.java:125) ~[flyway-core-5.2.4.jar:?]
at org.flywaydb.core.internal.resolver.sql.SqlMigrationExecutor.execute(SqlMigrationExecutor.java:77) ~[flyway-core-5.2.4.jar:?]
at org.flywaydb.core.internal.command.DbMigrate.doMigrateGroup(DbMigrate.java:367) ~[flyway-core-5.2.4.jar:?]
at org.flywaydb.core.internal.command.DbMigrate.access$200(DbMigrate.java:54) ~[flyway-core-5.2.4.jar:?]
at org.flywaydb.core.internal.command.DbMigrate$3.call(DbMigrate.java:284)
Job's log exceeded limit of 16777216 bytes.
failed
test_postgres_10_compatibility Test The script exceeded the maximum execution time set for the job
	at org.postgresql.core.v3.QueryExecutorImpl.receiveErrorResponse(QueryExecutorImpl.java:2440) ~[postgresql-42.2.5.jar:42.2.5]
at org.postgresql.core.v3.QueryExecutorImpl.processResults(QueryExecutorImpl.java:2183) ~[postgresql-42.2.5.jar:42.2.5]
at org.postgresql.core.v3.QueryExecutorImpl.execute(QueryExecutorImpl.java:308) ~[postgresql-42.2.5.jar:42.2.5]
at org.postgresql.jdbc.PgStatement.executeInternal(PgStatement.java:441) ~[postgresql-42.2.5.jar:42.2.5]
at org.postgresql.jdbc.PgStatement.execute(PgStatement.java:365) ~[postgresql-42.2.5.jar:42.2.5]
at org.postgresql.jdbc.PgStatement.executeWithFlags(PgStatement.java:307) ~[postgresql-42.2.5.jar:42.2.5]
at org.postgresql.jdbc.PgStatement.executeCachedSql(PgStatement.java:293) ~[postgresql-42.2.5.jar:42.2.5]
at org.postgresql.jdbc.PgStatement.executeWithFlags(PgStatement.java:270) ~[postgresql-42.2.5.jar:42.2.5]
at org.postgresql.jdbc.PgStatement.execute(PgStatement.java:266) ~[postgresql-42.2
Job's log exceeded limit of 16777216 bytes.
failed
test:backend:web:hsql Test The script exceeded the maximum execution time set for the job
2021-01-15 15:00:16,692 DEBUG [main] (AuthenticationSuccessHandlerImpl.java:52) - User admin successfully logged in using LOCAL authentication method
2021-01-15 15:00:18,067 DEBUG [Thread-15] (ProjectService.java:343) - Running: test_project; lcsb.mapviewer.model.cache.UploadedFileEntry@779f5f9e
2021-01-15 15:00:18,201 DEBUG [Thread-15] (ProjectService.java:865) - Model created
2021-01-15 15:00:18,222 DEBUG [Thread-15] (MapGenerator.java:60) - Creating nested model with 2 levels and maximum zoom rate: 2.34375
2021-01-15 15:00:18,774 DEBUG [Thread-15] (MapGenerator.java:62) - Creating not nested model with 2 levels and maximum zoom rate: 2.34375
2021-01-15 15:00:18,932 DEBUG [Thread-15] (MapGenerator.java:62) - Creating not nested model with 2 levels and maximum zoom rate: 2.34375
2021-01-15 15:00:19,136 WARN [Thread-15] (EmailSender.java:122) - Cannot send email. No smpt server defined
2021-01-15 15:00:19,137 INFO [Thread-15] (ProjectService.java:391) - Project test_project created successfully.
ERROR: Job failed: execution took longer than 1h0m0s seconds
failed
test:backend:web:jdk-11 Test The script exceeded the maximum execution time set for the job
2021-01-15 15:03:43,558 DEBUG [main] (AuthenticationSuccessHandlerImpl.java:52) - User admin successfully logged in using LOCAL authentication method
2021-01-15 15:03:44,083 DEBUG [Thread-33] (ProjectService.java:343) - Running: test_project; lcsb.mapviewer.model.cache.UploadedFileEntry@1ddf6cc1
2021-01-15 15:03:44,114 DEBUG [Thread-33] (ProjectService.java:865) - Model created
2021-01-15 15:03:44,124 DEBUG [Thread-33] (MapGenerator.java:60) - Creating nested model with 2 levels and maximum zoom rate: 2.34375
2021-01-15 15:03:44,270 DEBUG [Thread-33] (MapGenerator.java:62) - Creating not nested model with 2 levels and maximum zoom rate: 2.34375
2021-01-15 15:03:44,396 DEBUG [Thread-33] (MapGenerator.java:62) - Creating not nested model with 2 levels and maximum zoom rate: 2.34375
2021-01-15 15:03:44,505 WARN [Thread-33] (EmailSender.java:122) - Cannot send email. No smpt server defined
2021-01-15 15:03:44,505 INFO [Thread-33] (ProjectService.java:391) - Project test_project created successfully.
ERROR: Job failed: execution took longer than 1h0m0s seconds
failed
test:backend:web:jdk-8 Test The script exceeded the maximum execution time set for the job
2021-01-15 15:04:00,685 DEBUG [main] (AuthenticationSuccessHandlerImpl.java:52) - User admin successfully logged in using LOCAL authentication method
2021-01-15 15:04:01,123 DEBUG [Thread-129] (ProjectService.java:343) - Running: test_project; lcsb.mapviewer.model.cache.UploadedFileEntry@32d66802
2021-01-15 15:04:01,155 DEBUG [Thread-129] (ProjectService.java:865) - Model created
2021-01-15 15:04:01,165 DEBUG [Thread-129] (MapGenerator.java:60) - Creating nested model with 2 levels and maximum zoom rate: 2.34375
2021-01-15 15:04:01,337 DEBUG [Thread-129] (MapGenerator.java:62) - Creating not nested model with 2 levels and maximum zoom rate: 2.34375
2021-01-15 15:04:01,465 DEBUG [Thread-129] (MapGenerator.java:62) - Creating not nested model with 2 levels and maximum zoom rate: 2.34375
2021-01-15 15:04:01,591 WARN [Thread-129] (EmailSender.java:122) - Cannot send email. No smpt server defined
2021-01-15 15:04:01,591 INFO [Thread-129] (ProjectService.java:391) - Project test_project created successfully.
ERROR: Job failed: execution took longer than 1h0m0s seconds
failed
test:backend:pathvisio:jdk-11 Test
[ERROR] -> [Help 1]
[ERROR]
[ERROR] To see the full stack trace of the errors, re-run Maven with the -e switch.
[ERROR] Re-run Maven using the -X switch to enable full debug logging.
[ERROR]
[ERROR] For more information about the errors and possible solutions, please read the following articles:
[ERROR] [Help 1] http://cwiki.apache.org/confluence/display/MAVEN/MojoFailureException
Cleaning up file based variables
ERROR: Job failed: exit code 1
failed
test:frontend Test
=============================== Coverage summary ===============================
Statements : 85.43% ( 16520/19337 )
Branches : 69.21% ( 3268/4722 )
Functions : 82.09% ( 3081/3753 )
Lines : 85.48% ( 16516/19321 )
================================================================================
npm ERR! Test failed. See above for more details.
Cleaning up file based variables
ERROR: Job failed: exit code 1
failed
test:backend:pathvisio:jdk-8 Test
[ERROR] -> [Help 1]
[ERROR]
[ERROR] To see the full stack trace of the errors, re-run Maven with the -e switch.
[ERROR] Re-run Maven using the -X switch to enable full debug logging.
[ERROR]
[ERROR] For more information about the errors and possible solutions, please read the following articles:
[ERROR] [Help 1] http://cwiki.apache.org/confluence/display/MAVEN/MojoFailureException
Cleaning up file based variables
ERROR: Job failed: exit code 1