Merge branch 'mirtarbase-fix' into 'devel_15.0.x'

miretarbase is down

See merge request !1247
32 jobs for devel_15.0.x in 24 minutes and 11 seconds (queued for 14 seconds)
latest
Status Name Job ID Coverage
  Test
failed test:backend:annotation:jdk-11 #215237

00:11:43

failed test:backend:annotation:jdk-8 #215234

00:13:27

passed test:backend:CellDesigner_plugin:jdk-8 #215239

00:02:15

85.3357%
passed test:backend:commons:jdk-11 #215230

00:02:44

84.4813%
passed test:backend:commons:jdk-8 #215226

00:02:26

84.4813%
passed test:backend:converter_graphics:jdk-11 #215247

00:02:02

73.2672%
passed test:backend:converter_graphics:jdk-8 #215245

00:03:12

73.2731%
passed test:backend:converter:jdk-11 #215243

00:02:55

61.5259%
passed test:backend:converter:jdk-8 #215241

00:02:34

61.4972%
passed test:backend:converter_SBGNML:jdk-11 #215251

00:08:23

88.9235%
passed test:backend:converter_SBGNML:jdk-8 #215249

00:04:09

88.9209%
passed test:backend:converter_SBML:jdk-11 #215255

00:03:47

89.7562%
passed test:backend:converter_SBML:jdk-8 #215253

00:05:16

89.7548%
passed test:backend:model_command:jdk-11 #215263

00:03:09

75.5802%
passed test:backend:model_command:jdk-8 #215261

00:03:07

75.59%
passed test:backend:model:jdk-11 #215259

00:03:22

87.3469%
passed test:backend:model:jdk-8 #215258

00:03:22

87.3476%
passed test:backend:pathvisio:jdk-11 #215267

00:03:54

85.3246%
passed test:backend:pathvisio:jdk-8 #215265

00:03:01

passed test:backend:persist:jdk-11 #215271

00:02:49

90.9267%
passed test:backend:persist:jdk-8 #215269

00:02:48

90.9442%
passed test:backend:rest:jdk-11 #215276

00:09:33

44.5855%
passed test:backend:rest:jdk-8 #215274

00:06:58

44.5792%
passed test:backend:service:jdk-11 #215280

00:11:06

62.9927%
passed test:backend:service:jdk-8 #215278

00:10:40

62.9913%
passed test:backend:web:jdk-11 #215284

00:14:24

47.5367%
passed test:backend:web:jdk-8 #215282

00:14:21

47.5367%
passed test:dependency_conflict #215286

00:05:00

passed test:frontend #215222

00:03:47

85.87%
passed test_postgres_10_compatibility #215290

00:02:40

passed test_postgres_11_compatibility #215292

00:01:55

passed test_postgres_9_3_compatibility #215288

00:02:29

 
Name Stage Failure
failed
test:backend:annotation:jdk-8 Test
[ERROR] -> [Help 1]
[ERROR]
[ERROR] To see the full stack trace of the errors, re-run Maven with the -e switch.
[ERROR] Re-run Maven using the -X switch to enable full debug logging.
[ERROR]
[ERROR] For more information about the errors and possible solutions, please read the following articles:
[ERROR] [Help 1] http://cwiki.apache.org/confluence/display/MAVEN/MojoFailureException
Cleaning up file based variables
ERROR: Job failed: exit code 1
failed
test:backend:annotation:jdk-11 Test
[ERROR] -> [Help 1]
[ERROR]
[ERROR] To see the full stack trace of the errors, re-run Maven with the -e switch.
[ERROR] Re-run Maven using the -X switch to enable full debug logging.
[ERROR]
[ERROR] For more information about the errors and possible solutions, please read the following articles:
[ERROR] [Help 1] http://cwiki.apache.org/confluence/display/MAVEN/MojoFailureException
Cleaning up file based variables
ERROR: Job failed: exit code 1