Merge branch '1357-sbgn-view-state-variables-are-not-stadium-shape' into 'master'

Resolve "SBGN view: state variables are not stadium shape"

Closes #1357

See merge request !1240
32 jobs for master in 19 minutes and 6 seconds (queued for 14 seconds)
Status Job ID Name Coverage
  Test
passed #194920
test:backend:annotation:jdk-11

00:11:01

90.78%
failed #194918
test:backend:annotation:jdk-8

00:11:55

passed #194922
test:backend:CellDesigner_plugin:jdk-8

00:03:18

86.3958%
passed #194916
test:backend:commons:jdk-11

00:01:44

84.4813%
passed #194914
test:backend:commons:jdk-8

00:02:57

84.4813%
passed #194931
test:backend:converter_graphics:jdk-11

00:02:23

73.1101%
passed #194929
test:backend:converter_graphics:jdk-8

00:03:14

73.1159%
passed #194926
test:backend:converter:jdk-11

00:01:32

61.8608%
passed #194924
test:backend:converter:jdk-8

00:02:23

61.8329%
passed #194934
test:backend:converter_SBGNML:jdk-11

00:10:02

88.937%
passed #194932
test:backend:converter_SBGNML:jdk-8

00:07:18

88.9358%
passed #194938
test:backend:converter_SBML:jdk-11

00:06:31

89.7379%
passed #194936
test:backend:converter_SBML:jdk-8

00:03:51

89.7366%
passed #194946
test:backend:model_command:jdk-11

00:02:18

75.9544%
passed #194944
test:backend:model_command:jdk-8

00:02:08

75.9519%
passed #194942
test:backend:model:jdk-11

00:04:08

87.4856%
passed #194940
test:backend:model:jdk-8

00:04:02

87.4863%
passed #194950
test:backend:pathvisio:jdk-11

00:03:45

85.3568%
passed #194948
test:backend:pathvisio:jdk-8

00:02:22

85.3588%
passed #194954
test:backend:persist:jdk-11

00:04:02

90.7628%
passed #194952
test:backend:persist:jdk-8

00:04:02

90.7806%
passed #194958
test:backend:rest:jdk-11

00:07:22

44.2421%
passed #194956
test:backend:rest:jdk-8

00:06:31

44.2359%
passed #194962
test:backend:service:jdk-11

00:09:13

62.3362%
passed #194960
test:backend:service:jdk-8

00:06:59

62.3345%
passed #194966
test:backend:web:jdk-11

00:12:04

47.5367%
passed #194964
test:backend:web:jdk-8

00:12:51

47.5367%
passed #194968
test:dependency_conflict

00:04:12

failed #194912
test:frontend

00:05:47

85.56%
passed #194972
test_postgres_10_compatibility

00:02:24

passed #194974
test_postgres_11_compatibility

00:03:12

passed #194970
test_postgres_9_3_compatibility

00:03:40

 
Name Stage Failure
failed
test:frontend Test

=============================== Coverage summary ===============================
Statements : 85.56% ( 16668/19481 )
Branches : 69.28% ( 3273/4724 )
Functions : 82.23% ( 3095/3764 )
Lines : 85.61% ( 16664/19465 )
================================================================================
npm ERR! Test failed. See above for more details.
ERROR: Job failed: exit code 1
failed
test:backend:annotation:jdk-8 Test
[ERROR] Please refer to dump files (if any exist) [date].dump, [date]-jvmRun[N].dump and [date].dumpstream.
[ERROR] -> [Help 1]
[ERROR]
[ERROR] To see the full stack trace of the errors, re-run Maven with the -e switch.
[ERROR] Re-run Maven using the -X switch to enable full debug logging.
[ERROR]
[ERROR] For more information about the errors and possible solutions, please read the following articles:
[ERROR] [Help 1] http://cwiki.apache.org/confluence/display/MAVEN/MojoFailureException
ERROR: Job failed: exit code 1