Merge branch '1330-add-instance-name-to-request-an-account-email-s-title' into 'master'

Resolve "add instance name to 'request an account' email's title"

Closes #1330

See merge request !1225
32 jobs for master in 19 minutes and 42 seconds (queued for 14 seconds)
Status Job ID Name Coverage
  Test
failed #192288
test:backend:annotation:jdk-11

00:14:59

failed #192285
test:backend:annotation:jdk-8

00:14:07

passed #192290
test:backend:CellDesigner_plugin:jdk-8

00:03:41

85.3357%
passed #192283
test:backend:commons:jdk-11

00:01:30

84.4813%
passed #192282
test:backend:commons:jdk-8

00:01:46

84.4813%
passed #192298
test:backend:converter_graphics:jdk-11

00:04:16

73.1872%
passed #192296
test:backend:converter_graphics:jdk-8

00:03:09

73.1931%
passed #192294
test:backend:converter:jdk-11

00:03:46

62.1762%
passed #192291
test:backend:converter:jdk-8

00:03:30

61.8329%
passed #192302
test:backend:converter_SBGNML:jdk-11

00:12:45

88.8236%
passed #192300
test:backend:converter_SBGNML:jdk-8

00:08:18

88.8223%
passed #192306
test:backend:converter_SBML:jdk-11

00:04:36

89.6252%
passed #192304
test:backend:converter_SBML:jdk-8

00:03:50

89.6105%
passed #192314
test:backend:model_command:jdk-11

00:04:15

75.5802%
passed #192312
test:backend:model_command:jdk-8

00:04:18

75.5775%
passed #192310
test:backend:model:jdk-11

00:04:44

87.3354%
passed #192308
test:backend:model:jdk-8

00:04:07

87.3362%
passed #192318
test:backend:pathvisio:jdk-11

00:05:34

85.4003%
passed #192316
test:backend:pathvisio:jdk-8

00:06:16

85.4024%
passed #192322
test:backend:persist:jdk-11

00:02:39

90.7628%
passed #192320
test:backend:persist:jdk-8

00:02:40

90.7806%
passed #192326
test:backend:rest:jdk-11

00:08:46

44.3371%
passed #192324
test:backend:rest:jdk-8

00:10:28

44.3308%
passed #192330
test:backend:service:jdk-11

00:07:53

62.4462%
passed #192328
test:backend:service:jdk-8

00:09:34

62.3685%
passed #192334
test:backend:web:jdk-11

00:12:16

47.5367%
passed #192332
test:backend:web:jdk-8

00:12:15

47.5367%
passed #192336
test:dependency_conflict

00:04:37

failed #192279
test:frontend

00:04:06

85.57%
passed #192340
test_postgres_10_compatibility

00:03:41

passed #192342
test_postgres_11_compatibility

00:02:32

passed #192338
test_postgres_9_3_compatibility

00:02:23

 
Name Stage Failure
failed
test:frontend Test

=============================== Coverage summary ===============================
Statements : 85.57% ( 16667/19477 )
Branches : 69.32% ( 3272/4720 )
Functions : 82.23% ( 3095/3764 )
Lines : 85.62% ( 16663/19461 )
================================================================================
npm ERR! Test failed. See above for more details.
ERROR: Job failed: exit code 1
failed
test:backend:annotation:jdk-11 Test
[ERROR] Please refer to dump files (if any exist) [date].dump, [date]-jvmRun[N].dump and [date].dumpstream.
[ERROR] -> [Help 1]
[ERROR]
[ERROR] To see the full stack trace of the errors, re-run Maven with the -e switch.
[ERROR] Re-run Maven using the -X switch to enable full debug logging.
[ERROR]
[ERROR] For more information about the errors and possible solutions, please read the following articles:
[ERROR] [Help 1] http://cwiki.apache.org/confluence/display/MAVEN/MojoFailureException
ERROR: Job failed: exit code 1
failed
test:backend:annotation:jdk-8 Test
[ERROR] Please refer to dump files (if any exist) [date].dump, [date]-jvmRun[N].dump and [date].dumpstream.
[ERROR] -> [Help 1]
[ERROR]
[ERROR] To see the full stack trace of the errors, re-run Maven with the -e switch.
[ERROR] Re-run Maven using the -X switch to enable full debug logging.
[ERROR]
[ERROR] For more information about the errors and possible solutions, please read the following articles:
[ERROR] [Help 1] http://cwiki.apache.org/confluence/display/MAVEN/MojoFailureException
ERROR: Job failed: exit code 1