uploading of the page with low internet connection speed produced empty screen...

uploading of the page with low internet connection speed produced empty screen for several seconds/minutes
32 jobs for 1040-upload-genomic in 11 minutes and 28 seconds (queued for 4 seconds)
Status Name Job ID Coverage
  Test
failed test:backend:annotation:jdk-11 #106584

00:11:07

failed test:backend:annotation:jdk-8 #106583

00:09:49

passed test:backend:CellDesigner_plugin:jdk-8 #106585

00:01:32

85.3486%
passed test:backend:commons:jdk-11 #106582

00:01:14

87.4845%
passed test:backend:commons:jdk-8 #106581

00:01:05

87.4845%
passed test:backend:converter_graphics:jdk-11 #106589

00:01:30

53.6256%
passed test:backend:converter_graphics:jdk-8 #106588

00:01:19

53.6298%
passed test:backend:converter:jdk-11 #106587

00:01:05

61.6095%
passed test:backend:converter:jdk-8 #106586

00:01:09

61.5803%
passed test:backend:converter_SBGNML:jdk-11 #106591

00:02:09

90.1689%
passed test:backend:converter_SBGNML:jdk-8 #106590

00:02:03

90.1719%
passed test:backend:converter_SBML:jdk-11 #106593

00:01:46

89.6159%
passed test:backend:converter_SBML:jdk-8 #106592

00:01:58

89.6299%
passed test:backend:model_command:jdk-11 #106597

00:01:15

73.2929%
passed test:backend:model_command:jdk-8 #106596

00:01:14

73.3019%
passed test:backend:model:jdk-11 #106595

00:01:18

89.1388%
passed test:backend:model:jdk-8 #106594

00:01:24

89.1367%
passed test:backend:pathvisio:jdk-11 #106599

00:01:41

81.8756%
passed test:backend:pathvisio:jdk-8 #106598

00:01:41

81.8773%
passed test:backend:persist:jdk-11 #106601

00:01:50

92.7869%
passed test:backend:persist:jdk-8 #106600

00:01:44

92.8071%
passed test:backend:rest:jdk-11 #106603

00:04:36

48.6657%
passed test:backend:rest:jdk-8 #106602

00:04:15

48.6572%
passed test:backend:service:jdk-11 #106605

00:04:04

59.2298%
passed test:backend:service:jdk-8 #106604

00:04:02

59.2345%
passed test:backend:web:jdk-11 #106607

00:09:00

46.9729%
passed test:backend:web:jdk-8 #106606

00:08:53

46.9729%
passed test:dependency_conflict #106608

00:03:19

passed test:frontend #106580

00:02:35

87.38%
passed test_postgres_10_compatibility #106610

00:01:32

passed test_postgres_11_compatibility #106611

00:01:37

passed test_postgres_9_3_compatibility #106609

00:01:29

 
Name Stage Failure
failed
test:backend:annotation:jdk-8 Test
[ERROR] Please refer to dump files (if any exist) [date].dump, [date]-jvmRun[N].dump and [date].dumpstream.
[ERROR] -> [Help 1]
[ERROR]
[ERROR] To see the full stack trace of the errors, re-run Maven with the -e switch.
[ERROR] Re-run Maven using the -X switch to enable full debug logging.
[ERROR]
[ERROR] For more information about the errors and possible solutions, please read the following articles:
[ERROR] [Help 1] http://cwiki.apache.org/confluence/display/MAVEN/MojoFailureException
ERROR: Job failed: exit code 1
failed
test:backend:annotation:jdk-11 Test
[ERROR] Please refer to dump files (if any exist) [date].dump, [date]-jvmRun[N].dump and [date].dumpstream.
[ERROR] -> [Help 1]
[ERROR]
[ERROR] To see the full stack trace of the errors, re-run Maven with the -e switch.
[ERROR] Re-run Maven using the -X switch to enable full debug logging.
[ERROR]
[ERROR] For more information about the errors and possible solutions, please read the following articles:
[ERROR] [Help 1] http://cwiki.apache.org/confluence/display/MAVEN/MojoFailureException
ERROR: Job failed: exit code 1