hibernate exceptions on uploading project weren't caught properly

32 jobs for 1040-upload-genomic in 16 minutes and 50 seconds (queued for 4 seconds)
Status Name Job ID Coverage
  Test
failed test:backend:annotation:jdk-11 #106551

00:16:49

failed test:backend:annotation:jdk-8 #106550

00:16:14

passed test:backend:CellDesigner_plugin:jdk-8 #106552

00:01:27

85.3486%
passed test:backend:commons:jdk-11 #106549

00:01:11

87.4845%
passed test:backend:commons:jdk-8 #106548

00:00:57

87.4845%
passed test:backend:converter_graphics:jdk-11 #106556

00:02:07

53.6256%
passed test:backend:converter_graphics:jdk-8 #106555

00:01:21

53.6298%
passed test:backend:converter:jdk-11 #106554

00:01:01

61.6095%
passed test:backend:converter:jdk-8 #106553

00:01:04

61.5803%
passed test:backend:converter_SBGNML:jdk-11 #106558

00:02:19

90.1689%
passed test:backend:converter_SBGNML:jdk-8 #106557

00:02:39

90.1719%
passed test:backend:converter_SBML:jdk-11 #106560

00:01:46

89.6159%
passed test:backend:converter_SBML:jdk-8 #106559

00:01:54

89.6299%
passed test:backend:model_command:jdk-11 #106564

00:01:14

73.2929%
passed test:backend:model_command:jdk-8 #106563

00:01:00

73.3019%
passed test:backend:model:jdk-11 #106562

00:01:10

89.1388%
passed test:backend:model:jdk-8 #106561

00:01:14

89.1367%
passed test:backend:pathvisio:jdk-11 #106566

00:01:36

81.8756%
passed test:backend:pathvisio:jdk-8 #106565

00:01:34

81.8773%
passed test:backend:persist:jdk-11 #106568

00:01:35

92.7869%
passed test:backend:persist:jdk-8 #106567

00:01:42

92.8071%
passed test:backend:rest:jdk-11 #106570

00:04:58

48.6657%
passed test:backend:rest:jdk-8 #106569

00:04:35

48.6572%
passed test:backend:service:jdk-11 #106572

00:04:09

59.2298%
passed test:backend:service:jdk-8 #106571

00:04:01

59.2345%
passed test:backend:web:jdk-11 #106574

00:09:08

46.9729%
passed test:backend:web:jdk-8 #106573

00:09:07

46.9729%
passed test:dependency_conflict #106575

00:03:24

passed test:frontend #106547

00:02:33

87.38%
passed test_postgres_10_compatibility #106577

00:01:34

passed test_postgres_11_compatibility #106578

00:01:26

passed test_postgres_9_3_compatibility #106576

00:01:43

 
Name Stage Failure
failed
test:backend:annotation:jdk-11 Test
[ERROR] Please refer to dump files (if any exist) [date].dump, [date]-jvmRun[N].dump and [date].dumpstream.
[ERROR] -> [Help 1]
[ERROR]
[ERROR] To see the full stack trace of the errors, re-run Maven with the -e switch.
[ERROR] Re-run Maven using the -X switch to enable full debug logging.
[ERROR]
[ERROR] For more information about the errors and possible solutions, please read the following articles:
[ERROR] [Help 1] http://cwiki.apache.org/confluence/display/MAVEN/MojoFailureException
ERROR: Job failed: exit code 1
failed
test:backend:annotation:jdk-8 Test
[ERROR] Please refer to dump files (if any exist) [date].dump, [date]-jvmRun[N].dump and [date].dumpstream.
[ERROR] -> [Help 1]
[ERROR]
[ERROR] To see the full stack trace of the errors, re-run Maven with the -e switch.
[ERROR] Re-run Maven using the -X switch to enable full debug logging.
[ERROR]
[ERROR] For more information about the errors and possible solutions, please read the following articles:
[ERROR] [Help 1] http://cwiki.apache.org/confluence/display/MAVEN/MojoFailureException
ERROR: Job failed: exit code 1