Merge remote-tracking branch 'remotes/origin/master' into 486-activity-flow-support

32 jobs for 486-activity-flow-support in 11 minutes and 30 seconds (queued for 2 seconds)
latest
Status Name Job ID Coverage
  Test
passed test:backend:annotation:jdk-11 #86724

00:08:41

86.4765%
passed test:backend:annotation:jdk-8 #86723

00:09:35

86.4834%
passed test:backend:CellDesigner_plugin:jdk-8 #86725

00:01:40

85.3486%
passed test:backend:commons:jdk-11 #86722

00:01:16

87.5269%
passed test:backend:commons:jdk-8 #86721

00:00:51

87.5269%
passed test:backend:converter_graphics:jdk-11 #86729

00:01:16

53.6256%
passed test:backend:converter_graphics:jdk-8 #86728

00:01:12

53.6298%
passed test:backend:converter:jdk-11 #86727

00:00:54

61.6971%
passed test:backend:converter:jdk-8 #86726

00:00:56

61.3362%
failed test:backend:converter_SBGNML:jdk-11 #86731

00:00:24

failed test:backend:converter_SBGNML:jdk-8 #86730

00:00:23

passed test:backend:converter_SBML:jdk-11 #86733

00:04:08

89.4697%
passed test:backend:converter_SBML:jdk-8 #86732

00:01:45

89.4839%
passed test:backend:model_command:jdk-11 #86737

00:01:06

73.1454%
passed test:backend:model_command:jdk-8 #86736

00:01:38

73.1678%
passed test:backend:model:jdk-11 #86735

00:01:51

88.9772%
passed test:backend:model:jdk-8 #86734

00:01:05

88.9751%
passed test:backend:pathvisio:jdk-11 #86739

00:01:58

81.8756%
passed test:backend:pathvisio:jdk-8 #86738

00:01:20

81.8773%
passed test:backend:persist:jdk-11 #86741

00:02:00

92.7869%
passed test:backend:persist:jdk-8 #86740

00:01:54

92.8071%
passed test:backend:rest:jdk-11 #86743

00:04:55

48.6657%
passed test:backend:rest:jdk-8 #86742

00:04:39

48.6572%
passed test:backend:service:jdk-11 #86745

00:04:51

59.2298%
passed test:backend:service:jdk-8 #86744

00:04:33

59.2731%
passed test:backend:web:jdk-11 #86747

00:10:13

46.9729%
passed test:backend:web:jdk-8 #86746

00:09:27

46.9729%
passed test:dependency_conflict #86748

00:03:34

passed test:frontend #86720

00:02:26

87.38%
passed test_postgres_10_compatibility #86750

00:01:33

passed test_postgres_11_compatibility #86751

00:01:26

passed test_postgres_9_3_compatibility #86749

00:01:29

 
Name Stage Failure
failed
test:backend:converter_SBGNML:jdk-11 Test
[WARNING] 
[ERROR] [ERROR] Could not find the selected project in the reactor: converter-SBGNML @
[ERROR] Could not find the selected project in the reactor: converter-SBGNML -> [Help 1]
[ERROR]
[ERROR] To see the full stack trace of the errors, re-run Maven with the -e switch.
[ERROR] Re-run Maven using the -X switch to enable full debug logging.
[ERROR]
[ERROR] For more information about the errors and possible solutions, please read the following articles:
[ERROR] [Help 1] http://cwiki.apache.org/confluence/display/MAVEN/MavenExecutionException
failed
test:backend:converter_SBGNML:jdk-8 Test
[ERROR] [ERROR] Could not find the selected project in the reactor: converter-SBGNML @ 
[ERROR] Could not find the selected project in the reactor: converter-SBGNML -> [Help 1]
[ERROR]
[ERROR] To see the full stack trace of the errors, re-run Maven with the -e switch.
[ERROR] Re-run Maven using the -X switch to enable full debug logging.
[ERROR]
[ERROR] For more information about the errors and possible solutions, please read the following articles:
[ERROR] [Help 1] http://cwiki.apache.org/confluence/display/MAVEN/MavenExecutionException
ERROR: Job failed: exit code 1