Merge branch '886-molart-is-missing-in-the-context-menu-right-click-minerva-v14' into 'master'

Resolve "MolArt is missing in the context menu (right click). // minerva v14"

Closes #886

See merge request !878
32 jobs for 887-issue-during-upload-found-in-the-log-min-v-14 in 11 minutes and 49 seconds (queued for 2 seconds)
Status Name Job ID Coverage
  Test
passed test:backend:annotation:jdk-11 #75157

00:08:41

86.4627%
failed test:backend:annotation:jdk-8 #75156

00:09:00

passed test:backend:CellDesigner_plugin:jdk-8 #75158

00:01:21

85.3486%
passed test:backend:commons:jdk-11 #75155

00:01:03

87.4845%
passed test:backend:commons:jdk-8 #75154

00:01:01

87.4845%
passed test:backend:converter_graphics:jdk-11 #75162

00:01:18

53.7195%
passed test:backend:converter_graphics:jdk-8 #75161

00:01:06

53.7238%
passed test:backend:converter:jdk-11 #75160

00:01:03

61.2157%
passed test:backend:converter:jdk-8 #75159

00:00:59

61.5201%
passed test:backend:converter_SBGNML:jdk-11 #75164

00:01:58

90.0532%
passed test:backend:converter_SBGNML:jdk-8 #75163

00:02:00

90.0563%
passed test:backend:converter_SBML:jdk-11 #75166

00:01:42

89.3902%
passed test:backend:converter_SBML:jdk-8 #75165

00:01:35

89.3742%
passed test:backend:model_command:jdk-11 #75170

00:01:25

73.1454%
passed test:backend:model_command:jdk-8 #75169

00:00:58

73.1543%
passed test:backend:model:jdk-11 #75168

00:01:21

89.2627%
passed test:backend:model:jdk-8 #75167

00:01:09

89.2606%
passed test:backend:pathvisio:jdk-11 #75172

00:01:33

81.8756%
passed test:backend:pathvisio:jdk-8 #75171

00:01:28

81.8773%
passed test:backend:persist:jdk-11 #75174

00:01:42

92.9032%
passed test:backend:persist:jdk-8 #75173

00:01:37

92.9228%
passed test:backend:rest:jdk-11 #75176

00:04:34

48.9277%
passed test:backend:rest:jdk-8 #75175

00:04:25

48.9163%
passed test:backend:service:jdk-11 #75178

00:03:53

59.0026%
passed test:backend:service:jdk-8 #75177

00:04:10

59.0073%
passed test:backend:web:jdk-11 #75180

00:08:33

46.9729%
passed test:backend:web:jdk-8 #75179

00:08:09

46.9729%
passed test:dependency_conflict #75181

00:03:03

passed test:frontend #75153

00:02:15

87.43%
passed test_postgres_10_compatibility #75183

00:01:22

passed test_postgres_11_compatibility #75184

00:01:30

passed test_postgres_9_3_compatibility #75182

00:01:30

 
Name Stage Failure
failed
test:backend:annotation:jdk-8 Test
[ERROR] Please refer to dump files (if any exist) [date].dump, [date]-jvmRun[N].dump and [date].dumpstream.
[ERROR] -> [Help 1]
[ERROR]
[ERROR] To see the full stack trace of the errors, re-run Maven with the -e switch.
[ERROR] Re-run Maven using the -X switch to enable full debug logging.
[ERROR]
[ERROR] For more information about the errors and possible solutions, please read the following articles:
[ERROR] [Help 1] http://cwiki.apache.org/confluence/display/MAVEN/MojoFailureException
ERROR: Job failed: exit code 1