fixed redirect issue

21 jobs for 563-spring-security in 8 minutes and 13 seconds (queued for 1 second)
Status Name Job ID Coverage
  Test
passed dependency_conflict_check #68740

00:03:19

passed java_11_compatibility #68739

00:03:30

passed test_backend annotation #68725

00:07:41

86.2946%
passed test_backend CellDesigner-plugin #68726

00:01:20

85.3486%
passed test_backend commons #68724

00:01:00

87.6763%
passed test_backend converter #68727

00:00:45

60.5232%
passed test_backend converter-CellDesigner #68729

00:01:17

95.9996%
passed test_backend converter-graphics #68728

00:00:58

53.7172%
passed test_backend converter-SBGN-ML #68730

00:02:04

89.2842%
passed test_backend converter-SBML #68731

00:01:30

89.128%
passed test_backend model #68732

00:00:55

89.1673%
passed test_backend model-command #68733

00:00:56

73.0268%
passed test_backend pathvisio #68734

00:01:11

81.8823%
failed test_backend persist #68735

00:01:27

passed test_backend rest-api #68736

00:04:09

49.7109%
passed test_backend service #68738

00:03:43

58.4983%
failed test_backend web #68737

00:04:53

failed test_frontend #68723

00:01:36

48.14%
failed test_postgres_10_compatibility #68742

00:01:33

failed test_postgres_11_compatibility #68743

00:01:25

failed test_postgres_9_3_compatibility #68741

00:01:37

 
Name Stage Failure
failed
test_frontend Test

=============================== Coverage summary ===============================
Statements : 48.14% ( 8859/18403 )
Branches : 26.88% ( 1174/4367 )
Functions : 38.1% ( 1358/3564 )
Lines : 48.17% ( 8858/18389 )
================================================================================
npm ERR! Test failed. See above for more details.
ERROR: Job failed: exit code 1
failed
test_backend web Test
[ERROR] Please refer to dump files (if any exist) [date].dump, [date]-jvmRun[N].dump and [date].dumpstream.
[ERROR] -> [Help 1]
[ERROR]
[ERROR] To see the full stack trace of the errors, re-run Maven with the -e switch.
[ERROR] Re-run Maven using the -X switch to enable full debug logging.
[ERROR]
[ERROR] For more information about the errors and possible solutions, please read the following articles:
[ERROR] [Help 1] http://cwiki.apache.org/confluence/display/MAVEN/MojoFailureException
ERROR: Job failed: exit code 1
failed
test_postgres_9_3_compatibility Test
[ERROR] Please refer to dump files (if any exist) [date].dump, [date]-jvmRun[N].dump and [date].dumpstream.
[ERROR] -> [Help 1]
[ERROR]
[ERROR] To see the full stack trace of the errors, re-run Maven with the -e switch.
[ERROR] Re-run Maven using the -X switch to enable full debug logging.
[ERROR]
[ERROR] For more information about the errors and possible solutions, please read the following articles:
[ERROR] [Help 1] http://cwiki.apache.org/confluence/display/MAVEN/MojoFailureException
ERROR: Job failed: exit code 1
failed
test_postgres_10_compatibility Test
[ERROR] Please refer to dump files (if any exist) [date].dump, [date]-jvmRun[N].dump and [date].dumpstream.
[ERROR] -> [Help 1]
[ERROR]
[ERROR] To see the full stack trace of the errors, re-run Maven with the -e switch.
[ERROR] Re-run Maven using the -X switch to enable full debug logging.
[ERROR]
[ERROR] For more information about the errors and possible solutions, please read the following articles:
[ERROR] [Help 1] http://cwiki.apache.org/confluence/display/MAVEN/MojoFailureException
ERROR: Job failed: exit code 1
failed
test_postgres_11_compatibility Test
[ERROR] Please refer to dump files (if any exist) [date].dump, [date]-jvmRun[N].dump and [date].dumpstream.
[ERROR] -> [Help 1]
[ERROR]
[ERROR] To see the full stack trace of the errors, re-run Maven with the -e switch.
[ERROR] Re-run Maven using the -X switch to enable full debug logging.
[ERROR]
[ERROR] For more information about the errors and possible solutions, please read the following articles:
[ERROR] [Help 1] http://cwiki.apache.org/confluence/display/MAVEN/MojoFailureException
ERROR: Job failed: exit code 1
failed
test_backend persist Test
[ERROR] Please refer to dump files (if any exist) [date].dump, [date]-jvmRun[N].dump and [date].dumpstream.
[ERROR] -> [Help 1]
[ERROR]
[ERROR] To see the full stack trace of the errors, re-run Maven with the -e switch.
[ERROR] Re-run Maven using the -X switch to enable full debug logging.
[ERROR]
[ERROR] For more information about the errors and possible solutions, please read the following articles:
[ERROR] [Help 1] http://cwiki.apache.org/confluence/display/MAVEN/MojoFailureException
ERROR: Job failed: exit code 1