adding today dependencies for R genomeInterval

34 jobs for 1.4.1 in 2 minutes and 10 seconds (queued for 33 seconds)
Status Job ID Name Coverage
  Dag
passed #8453
dag-mg-default

00:00:30

passed #8448
dag-mgmt-default

00:00:36

passed #8450
dag-mgmt-idba

00:00:32

passed #8449
dag-mgmt-maxbin

00:00:31

passed #8451
dag-mgmt-nf

00:00:31

passed #8452
dag-mgmt-nf2

00:00:30

failed #8459
dag-mgmt-no-binning

00:00:14

passed #8454
dag-mg-nf

00:00:29

passed #8455
dag-mg-nf2

00:00:36

passed #8461
dag-mg-no-binning

00:00:29

failed #8456
dag-mt-default

00:00:10

passed #8457
dag-mt-nf

00:00:37

passed #8458
dag-mt-nf2

00:00:36

failed #8460
dag-mt-no-binning

00:00:10

 
  Init
skipped #8462
i-cl
skipped #8463
i-with-another-filter
 
  Preprocessing
skipped #8466
p-mg-default
skipped #8464
p-mgmt-default
skipped #8465
p-mgmt-nf
skipped #8467
p-mg-nf
skipped #8468
p-mt-default
skipped #8469
p-mt-nf
 
  Assembly
skipped #8471
a-mg-megahit
skipped #8470
a-mgmt-megahit
skipped #8472
a-mt-megahit
 
  Analysis
skipped #8474
an-mg
skipped #8473
an-mgmt
skipped #8475
an-mt
 
  Manual
manual #8478
allowed to fail manual
a-mg-idba
manual #8477
allowed to fail manual
a-mgmt-idba
manual #8479
allowed to fail manual
a-mt-idba
manual #8476
allowed to fail manual
databases
manual #8481
allowed to fail manual
maxbin-mg
manual #8480
allowed to fail manual
maxbin-mgmt
 
Name Stage Failure
failed
dag-mt-default Dag There is an unknown failure, please try again
    status = self.run(options, args)
File "/home/gitlab-runner/.local/lib/python3.4/site-packages/pip/commands/install.py", line 342, in run
prefix=options.prefix_path,
File "/home/gitlab-runner/.local/lib/python3.4/site-packages/pip/req/req_set.py", line 778, in install
requirement.uninstall(auto_confirm=True)
File "/home/gitlab-runner/.local/lib/python3.4/site-packages/pip/req/req_install.py", line 703, in uninstall
'(at %s)' % (link_pointer, self.name, dist.location)
AssertionError: Egg-link /mnt/data/gitlab-runner/builds/658806ac/4/IMP/IMP does not match installed location of impy (at /mnt/data/gitlab-runner/builds/658806ac/2/IMP/IMP)
ERROR: Build failed: exit status 1
failed
dag-mgmt-no-binning Dag There is an unknown failure, please try again
    status = self.run(options, args)
File "/home/gitlab-runner/.local/lib/python3.4/site-packages/pip/commands/install.py", line 342, in run
prefix=options.prefix_path,
File "/home/gitlab-runner/.local/lib/python3.4/site-packages/pip/req/req_set.py", line 778, in install
requirement.uninstall(auto_confirm=True)
File "/home/gitlab-runner/.local/lib/python3.4/site-packages/pip/req/req_install.py", line 703, in uninstall
'(at %s)' % (link_pointer, self.name, dist.location)
AssertionError: Egg-link /mnt/data/gitlab-runner/builds/658806ac/1/IMP/IMP does not match installed location of impy (at /mnt/data/gitlab-runner/builds/658806ac/0/IMP/IMP)
ERROR: Build failed: exit status 1
failed
dag-mt-no-binning Dag There is an unknown failure, please try again
    status = self.run(options, args)
File "/home/gitlab-runner/.local/lib/python3.4/site-packages/pip/commands/install.py", line 342, in run
prefix=options.prefix_path,
File "/home/gitlab-runner/.local/lib/python3.4/site-packages/pip/req/req_set.py", line 778, in install
requirement.uninstall(auto_confirm=True)
File "/home/gitlab-runner/.local/lib/python3.4/site-packages/pip/req/req_install.py", line 703, in uninstall
'(at %s)' % (link_pointer, self.name, dist.location)
AssertionError: Egg-link /mnt/data/gitlab-runner/builds/658806ac/0/IMP/IMP does not match installed location of impy (at /mnt/data/gitlab-runner/builds/658806ac/2/IMP/IMP)
ERROR: Build failed: exit status 1