Fixed number precision and boxplot layout issues

2 jobs for master in 6 minutes and 59 seconds (queued for 2 seconds)
Name Stage Failure
failed
test:all Test
HeadlessChrome 66.0.3347 (Linux 0.0.0) TaskView cancel button works FAILED
Expected 1 to be 2.
at s.default.nextTick (test/task-view-test.js:38:228862)
at Array.<anonymous> (test/task-view-test.js:7:11359)
at Vt (test/task-view-test.js:7:10863)
HeadlessChrome 66.0.3347 (Linux 0.0.0): Executed 41 of 41 (1 FAILED) (0 secs / 0 secs)
HeadlessChrome 66.0.3347 (Linux 0.0.0): Executed 41 of 41 (1 FAILED) (4.363 secs / 0 secs)
npm ERR! Test failed. See above for more details.
ERROR: Job failed: exit code 1